BDBM65235 2-imidazolin-2-yl-[2-(1-naphthylthio)benzyl]amine;hydroiodide::MLS000702748::N-(4,5-dihydro-1H-imidazol-2-yl)-N-[2-(1-naphthylsulfanyl)benzyl]amine::N-[(2-naphthalen-1-ylsulfanylphenyl)methyl]-4,5-dihydro-1H-imidazol-2-amine;hydroiodide::N-[[2-(1-naphthalenylthio)phenyl]methyl]-4,5-dihydro-1H-imidazol-2-amine;hydroiodide::SMR000224870::cid_15945566
SMILES [#6](\[#7]=[#6]-1\[#7]-[#6]-[#6]-[#7]-1)-c1ccccc1-[#16]-c1cccc2ccccc12
InChI Key InChIKey=LHILIMCFIJCSHA-UHFFFAOYSA-N
Data  2 IC50
  Tab Delimited (TSV)   2D SDfile   Computed 3D by Vconf -m prep SDfile
Find this compound or compounds like it in BindingDB:
Activity Spreadsheet -- Enzyme Inhibition Constant Data from BindingDB
Found 2 hits for monomerid = 65235
TargetNACHT, LRR and PYD domains-containing protein 3(Homo sapiens (Human))
Burnham Center For Chemical Genomics
Curated by PubChem BioAssay
LigandPNGBDBM65235(2-imidazolin-2-yl-[2-(1-naphthylthio)benzyl]amine;...)
Affinity DataIC50:  7.62E+3nM. Assay description: Data Source: Sanford-Burnham Center for Chemical Genomics (SBCCG) Source Affiliation: Sanford-Burnham Medical Research Institute (SBMRI, San Diego, C...
In DepthDetails PCBioAssay
TargetNACHT, LRR and PYD domains-containing protein 3(Homo sapiens (Human))
Burnham Center For Chemical Genomics
Curated by PubChem BioAssay
LigandPNGBDBM65235(2-imidazolin-2-yl-[2-(1-naphthylthio)benzyl]amine;...)
Affinity DataIC50:  1.17E+4nM. Assay description: Data Source: Sanford-Burnham Center for Chemical Genomics (SBCCG) Source Affiliation: Sanford-Burnham Medical Research Institute (SBMRI, San Diego, C...
In DepthDetails PCBioAssay