BDBM65279 2-(3-methyl-1-adamantyl)acetic acid 2-[4-methyl-3-(4-nitrobenzyl)thiazol-3-ium-5-yl]ethyl ester;bromide::2-(3-methyl-1-adamantyl)acetic acid 2-[4-methyl-3-[(4-nitrophenyl)methyl]-5-thiazol-3-iumyl]ethyl ester;bromide::2-[4-methyl-3-[(4-nitrophenyl)methyl]-1,3-thiazol-3-ium-5-yl]ethyl 2-(3-methyl-1-adamantyl)acetate;bromide::2-[4-methyl-3-[(4-nitrophenyl)methyl]-1,3-thiazol-3-ium-5-yl]ethyl 2-(3-methyl-1-adamantyl)ethanoate;bromide::4-methyl-5-(2-{[(3-methyl-1-adamantyl)acetyl]oxy}ethyl)-3-(4-nitrobenzyl)-1,3-thiazol-3-ium bromide::MLS000684824::SMR000268123::cid_2884333
SMILES [H]C12CC3([H])CC(C)(C1)CC(CC(=O)OCCc1sc[n+](Cc4ccc(cc4)[N+]([O-])=O)c1C)(C2)C3
InChI Key InChIKey=OKTFAXLIKFXMON-UHFFFAOYSA-N
Data  1 EC50
  Tab Delimited (TSV)   2D SDfile   Computed 3D by Vconf -m prep SDfile
Find this compound or compounds like it in BindingDB:
Activity Spreadsheet -- Enzyme Inhibition Constant Data from BindingDB
Found 1 hit for monomerid = 65279
TargetMultidrug resistance protein CDR2(Candida albicans)
Nmmlsc
Curated by PubChem BioAssay
LigandPNGBDBM65279(2-(3-methyl-1-adamantyl)acetic acid 2-[4-methyl-3-...)
Affinity DataEC50:  1.09E+4nM. Assay description: UNMCMD Assay Overview: Assay Support: 1 R03 MH087406-01A1 Project Title: Identification of broad-spectrum antifungal efflux pump inhibitors ...
In DepthDetails PCBioAssay