BDBM65462 MLS000770462::N-(4-pyridin-2-yl-1,3-thiazol-2-yl)-1-benzofuran-2-carboxamide::N-[4-(2-pyridinyl)-2-thiazolyl]-2-benzofurancarboxamide::N-[4-(2-pyridyl)thiazol-2-yl]coumarilamide::SMR000343716::cid_2406187
SMILES O=C(Nc1nc(cs1)-c1ccccn1)c1cc2ccccc2o1
InChI Key InChIKey=BUMXSHBMVVXNRT-UHFFFAOYSA-N
Data  2 EC50
  Tab Delimited (TSV)   2D SDfile   Computed 3D by Vconf -m prep SDfile
Find this compound or compounds like it in BindingDB:
Activity Spreadsheet -- Enzyme Inhibition Constant Data from BindingDB
Found 2 hits for monomerid = 65462
TargetVacuolar aminopeptidase 1(Saccharomyces cerevisiae)
Nmmlsc
Curated by PubChem BioAssay
LigandPNGBDBM65462(MLS000770462 | N-(4-pyridin-2-yl-1,3-thiazol-2-yl)...)
Affinity DataEC50:  4.09E+3nM. Assay description: University of New Mexico Assay Overview: Assay Support: 1R03 MH086450-01 Project Title: Chemical Screen of TOR pathway GFP fusion proteins in S. ...
In DepthDetails PCBioAssay
Target60S ribosomal protein L19-A(Saccharomyces cerevisiae)
Nmmlsc
Curated by PubChem BioAssay
LigandPNGBDBM65462(MLS000770462 | N-(4-pyridin-2-yl-1,3-thiazol-2-yl)...)
Affinity DataEC50:  1.17E+4nM. Assay description: University of New Mexico Assay Overview: Assay Support: 1R03 MH086450-01 Project Title: Chemical Screen of TOR pathway GFP fusion proteins in S. ...
In DepthDetails PCBioAssay