BDBM65596 1-(4-Methoxy-phenyl)-2,6-diphenyl-4-p-tolyl-pyridinium::1-(4-methoxyphenyl)-2,6-diphenyl-4-(p-tolyl)pyridin-1-ium;perchlorate::1-(4-methoxyphenyl)-4-(4-methylphenyl)-2,6-diphenyl-pyridin-1-ium;perchlorate::1-(4-methoxyphenyl)-4-(4-methylphenyl)-2,6-diphenylpyridin-1-ium;perchlorate::MLS001208383::SMR000515429::cid_18528944
SMILES COc1ccc(cc1)-[n+]1c(cc(cc1-c1ccccc1)-c1ccc(C)cc1)-c1ccccc1
InChI Key InChIKey=DAIJKYBWCCHUQB-UHFFFAOYSA-N
Data  1 IC50
  Tab Delimited (TSV)   2D SDfile   Computed 3D by Vconf -m prep SDfile
Find this compound or compounds like it in BindingDB:
Activity Spreadsheet -- Enzyme Inhibition Constant Data from BindingDB
Found 1 hit for monomerid = 65596
TargetPotassium voltage-gated channel subfamily KQT member 2(Rattus norvegicus)
Johns Hopkins Ion Channel Center
Curated by PubChem BioAssay
LigandPNGBDBM65596(1-(4-Methoxy-phenyl)-2,6-diphenyl-4-p-tolyl-pyridi...)
Affinity DataIC50:  1.11E+4nM. Assay description: Source (MLPCN Center Name): Johns Hopkins Ion Channel Center (JHICC_KCNQ2_Inh_HFCP_IWS_CRC) Center Affiliation: Johns Hopkins University, School of M...
In DepthDetails PCBioAssay