BDBM65785 MLS-0374227.0001::N-[5-(dimethylsulfamoyl)-2-methyl-phenyl]-2-(2-furyl)cinchoninamide::N-[5-(dimethylsulfamoyl)-2-methyl-phenyl]-2-(furan-2-yl)quinoline-4-carboxamide::N-[5-(dimethylsulfamoyl)-2-methylphenyl]-2-(2-furanyl)-4-quinolinecarboxamide::N-[5-(dimethylsulfamoyl)-2-methylphenyl]-2-(furan-2-yl)quinoline-4-carboxamide::cid_16545909
SMILES CN(C)S(=O)(=O)c1ccc(C)c(NC(=O)c2cc(nc3ccccc23)-c2ccco2)c1
InChI Key InChIKey=JQXOHWFDAXWIEN-UHFFFAOYSA-N
Data  2 IC50
  Tab Delimited (TSV)   2D SDfile   Computed 3D by Vconf -m prep SDfile
Find this compound or compounds like it in BindingDB:
Activity Spreadsheet -- Enzyme Inhibition Constant Data from BindingDB
Found 2 hits for monomerid = 65785
TargetAmyloid-beta A4 precursor protein-binding family A member 1(Rattus norvegicus)
Burnham Center For Chemical Genomics
Curated by PubChem BioAssay
LigandPNGBDBM65785(MLS-0374227.0001 | N-[5-(dimethylsulfamoyl)-2-meth...)
Affinity DataIC50: >5.68E+4nM. Assay description: Data Source: Sanford-Burnham Center for Chemical Genomics (SBCCG) Source Affiliation: Sanford-Burnham Medical Research Institute (SBMRI, San Diego, C...
In DepthDetails PCBioAssay
TargetAmyloid-beta A4 precursor protein-binding family A member 1(Rattus norvegicus)
Burnham Center For Chemical Genomics
Curated by PubChem BioAssay
LigandPNGBDBM65785(MLS-0374227.0001 | N-[5-(dimethylsulfamoyl)-2-meth...)
Affinity DataIC50: >5.68E+4nM. Assay description: Data Source: Sanford-Burnham Center for Chemical Genomics (SBCCG) Source Affiliation: Sanford-Burnham Medical Research Institute (SBMRI, San Diego, C...
In DepthDetails PCBioAssay