BDBM65859 2-Cyclopropyl-1-phenethyl-1H-benzoimidazole::2-cyclopropyl-1-(2-phenylethyl)benzimidazole::2-cyclopropyl-1-phenethyl-benzimidazole::MLS000559477::SMR000149593::cid_2987440
SMILES C(Cn1c(nc2ccccc12)C1CC1)c1ccccc1
InChI Key InChIKey=ODBCNXRWJIPLEA-UHFFFAOYSA-N
Data  1 IC50
  Tab Delimited (TSV)   2D SDfile   Computed 3D by Vconf -m prep SDfile
Find this compound or compounds like it in BindingDB:
Activity Spreadsheet -- Enzyme Inhibition Constant Data from BindingDB
Found 1 hit for monomerid = 65859
TargetInward rectifier potassium channel 2(Mus musculus)
Johns Hopkins Ion Channel Center
Curated by PubChem BioAssay
LigandPNGBDBM65859(2-Cyclopropyl-1-phenethyl-1H-benzoimidazole | 2-cy...)
Affinity DataIC50:  2.57E+4nM. Assay description: Data Source: Johns Hopkins Ion Channel Center (JHICC) BioAssay Type: Confirmatory, Confirmatory Screening, Multiple Concentration Activity Observed. ...
In DepthDetails PCBioAssay