BDBM65884 (4-Chloro-phenyl)-(5-hydroxy-2-methyl-4,6-dinitro-benzofuran-3-yl)-methanone::(4-chlorophenyl)-(2-methyl-4,6-dinitro-5-oxidanyl-1-benzofuran-3-yl)methanone::(4-chlorophenyl)-(5-hydroxy-2-methyl-4,6-dinitro-1-benzofuran-3-yl)methanone::(4-chlorophenyl)-(5-hydroxy-2-methyl-4,6-dinitro-3-benzofuranyl)methanone::(4-chlorophenyl)-(5-hydroxy-2-methyl-4,6-dinitro-benzofuran-3-yl)methanone::MLS000777418::SMR000413810::cid_1415822
SMILES Cc1oc2cc(c(O)c([N+]([O-])=O)c2c1C(=O)c1ccc(Cl)cc1)[N+]([O-])=O
InChI Key InChIKey=HZSADKRNPPIODV-UHFFFAOYSA-N
Data  1 EC50
  Tab Delimited (TSV)   2D SDfile   Computed 3D by Vconf -m prep SDfile
Find this compound or compounds like it in BindingDB:
Activity Spreadsheet -- Enzyme Inhibition Constant Data from BindingDB
Found 1 hit for monomerid = 65884
TargetPotassium voltage-gated channel subfamily KQT member 2(Rattus norvegicus)
Johns Hopkins Ion Channel Center
Curated by PubChem BioAssay
LigandPNGBDBM65884((4-Chloro-phenyl)-(5-hydroxy-2-methyl-4,6-dinitro-...)
Affinity DataEC50:  5.55E+5nM. Assay description: BioAssay Type: Confirmatory, Concentration-Response Relationship Observed Source (MLPCN Center Name): Johns Hopkins Ion Channel Center (JHICC) Center...
In DepthDetails PCBioAssay