BDBM65889 1-[(2,2-dichlorocyclopropyl)methyl]-3-(4-methylphenyl)urea::1-[(2,2-dichlorocyclopropyl)methyl]-3-(p-tolyl)urea::1-[[2,2-bis(chloranyl)cyclopropyl]methyl]-3-(4-methylphenyl)urea::MLS001174777::SMR000592206::cid_4885085
SMILES Cc1ccc(NC(=O)NCC2CC2(Cl)Cl)cc1
InChI Key InChIKey=BATICMFMIDKQDV-UHFFFAOYSA-N
Data  1 EC50
  Tab Delimited (TSV)   2D SDfile   Computed 3D by Vconf -m prep SDfile
Find this compound or compounds like it in BindingDB:
Activity Spreadsheet -- Enzyme Inhibition Constant Data from BindingDB
Found 1 hit for monomerid = 65889
TargetPotassium voltage-gated channel subfamily KQT member 2(Rattus norvegicus)
Johns Hopkins Ion Channel Center
Curated by PubChem BioAssay
LigandPNGBDBM65889(1-[(2,2-dichlorocyclopropyl)methyl]-3-(4-methylphe...)
Affinity DataEC50:  2.17E+3nM. Assay description: BioAssay Type: Confirmatory, Concentration-Response Relationship Observed Source (MLPCN Center Name): Johns Hopkins Ion Channel Center (JHICC) Center...
In DepthDetails PCBioAssay