BDBM65914 2-[1-(3-bromobenzyl)indol-3-yl]sulfonyl-N-(5-methylisoxazol-3-yl)acetamide::2-[1-[(3-bromophenyl)methyl]indol-3-yl]sulfonyl-N-(5-methyl-1,2-oxazol-3-yl)acetamide::2-[1-[(3-bromophenyl)methyl]indol-3-yl]sulfonyl-N-(5-methyl-1,2-oxazol-3-yl)ethanamide::2-[[1-[(3-bromophenyl)methyl]-3-indolyl]sulfonyl]-N-(5-methyl-3-isoxazolyl)acetamide::VU0402604-1::cid_44247542
SMILES Cc1cc(NC(=O)CS(=O)(=O)c2cn(Cc3cccc(Br)c3)c3ccccc23)no1
InChI Key InChIKey=QETZNYYAKOOMBS-UHFFFAOYSA-N
Data  2 EC50
  Tab Delimited (TSV)   2D SDfile   Computed 3D by Vconf -m prep SDfile
Find this compound or compounds like it in BindingDB:
Activity Spreadsheet -- Enzyme Inhibition Constant Data from BindingDB
Found 2 hits for monomerid = 65914
TargetMuscarinic acetylcholine receptor M1(RAT)
Vanderbilt Institute Of Chemical Biology/Chemical Synthesis Core
Curated by ChEMBL
LigandPNGBDBM65914(2-[1-(3-bromobenzyl)indol-3-yl]sulfonyl-N-(5-methy...)
Affinity DataEC50:  3.79E+3nM. Assay description: Allosteric modulation at rat M1 receptor expressed in CHO cells by calcium mobilization assay
In DepthDetails ArticlePubMed
TargetMuscarinic acetylcholine receptor M1(RAT)
Vanderbilt Institute Of Chemical Biology/Chemical Synthesis Core
Curated by ChEMBL
LigandPNGBDBM65914(2-[1-(3-bromobenzyl)indol-3-yl]sulfonyl-N-(5-methy...)
Affinity DataEC50:  3.79E+3nM. Assay description: Assay Provider: P. Jeffery Conn Assay Provider Affiliation: Vanderbilt University Grant Title: Discovery of novel allosteric modulators of the M1 Mus...
In DepthDetails PCBioAssay