BDBM65924 1-(4-methoxyphenyl)-3-(3-pyridinyl)urea::1-(4-methoxyphenyl)-3-(3-pyridyl)urea::1-(4-methoxyphenyl)-3-pyridin-3-yl-urea::1-(4-methoxyphenyl)-3-pyridin-3-ylurea::VU0325197-2::cid_2837290
SMILES COc1ccc(NC(=O)Nc2cccnc2)cc1
InChI Key InChIKey=DJZIXMNKKSDCBD-UHFFFAOYSA-N
Data  1 EC50
  Tab Delimited (TSV)   2D SDfile   Computed 3D by Vconf -m prep SDfile
Find this compound or compounds like it in BindingDB:
Activity Spreadsheet -- Enzyme Inhibition Constant Data from BindingDB
Found 1 hit for monomerid = 65924
TargetPotassium voltage-gated channel subfamily KQT member 2(Rattus norvegicus)
Johns Hopkins Ion Channel Center
Curated by PubChem BioAssay
LigandPNGBDBM65924(1-(4-methoxyphenyl)-3-(3-pyridinyl)urea | 1-(4-met...)
Affinity DataEC50:  2.03E+5nM. Assay description: Name: Dose response of Retigabine-insensitive compounds that potentiate KCNQ2 potassium channel BioAssay Type: Confirmatory, Concentration-Response R...
In DepthDetails PCBioAssay