BDBM65928 1-(3-chlorophenyl)-3-(3-pyridinyl)urea::1-(3-chlorophenyl)-3-(3-pyridyl)urea::1-(3-chlorophenyl)-3-pyridin-3-yl-urea::1-(3-chlorophenyl)-3-pyridin-3-ylurea::VU0414968-1::cid_898797
SMILES Clc1cccc(NC(=O)Nc2cccnc2)c1
InChI Key InChIKey=QGLBBAUVPATXPV-UHFFFAOYSA-N
Data  1 EC50
PDB links: 1 PDB ID matches this monomer.
  Tab Delimited (TSV)   2D SDfile   Computed 3D by Vconf -m prep SDfile
Find this compound or compounds like it in BindingDB:
Activity Spreadsheet -- Enzyme Inhibition Constant Data from BindingDB
Found 1 hit for monomerid = 65928
TargetPotassium voltage-gated channel subfamily KQT member 2(Rattus norvegicus)
Johns Hopkins Ion Channel Center
Curated by PubChem BioAssay
LigandPNGBDBM65928(1-(3-chlorophenyl)-3-(3-pyridinyl)urea | 1-(3-chlo...)
Affinity DataEC50:  1.83E+4nM. Assay description: Name: Dose response of Retigabine-insensitive compounds that potentiate KCNQ2 potassium channel BioAssay Type: Confirmatory, Concentration-Response R...
In DepthDetails PCBioAssay