BDBM65940 1-(3,4-dimethylphenyl)-3-(3-pyridinyl)urea::1-(3,4-dimethylphenyl)-3-(3-pyridyl)urea::1-(3,4-dimethylphenyl)-3-pyridin-3-yl-urea::1-(3,4-dimethylphenyl)-3-pyridin-3-ylurea::VU0415004-1::cid_6468027
SMILES Cc1ccc(NC(=O)Nc2cccnc2)cc1C
InChI Key InChIKey=HFSQGWGERIZBMU-UHFFFAOYSA-N
Data  1 EC50
  Tab Delimited (TSV)   2D SDfile   Computed 3D by Vconf -m prep SDfile
Find this compound or compounds like it in BindingDB:
Activity Spreadsheet -- Enzyme Inhibition Constant Data from BindingDB
Found 1 hit for monomerid = 65940
TargetPotassium voltage-gated channel subfamily KQT member 2(Rattus norvegicus)
Johns Hopkins Ion Channel Center
Curated by PubChem BioAssay
LigandPNGBDBM65940(1-(3,4-dimethylphenyl)-3-(3-pyridinyl)urea | 1-(3,...)
Affinity DataEC50:  1.35E+4nM. Assay description: Name: Dose response of Retigabine-insensitive compounds that potentiate KCNQ2 potassium channel BioAssay Type: Confirmatory, Concentration-Response R...
In DepthDetails PCBioAssay