BDBM65960 10-ethylphenothiazine 5,5-dioxide::SR-01000814044::SR-01000814044-3::cid_621197
SMILES CCN1c2ccccc2S(=O)(=O)c2ccccc12
InChI Key InChIKey=SQIYZBNATIFUHF-UHFFFAOYSA-N
Data  1 IC50
  Tab Delimited (TSV)   2D SDfile   Computed 3D by Vconf -m prep SDfile
Find this compound or compounds like it in BindingDB:
Activity Spreadsheet -- Enzyme Inhibition Constant Data from BindingDB
Found 1 hit for monomerid = 65960
TargetNADPH oxidase 1(Homo sapiens (Human))
The Scripps Research Institute Molecular Screening Center
Curated by PubChem BioAssay
LigandPNGBDBM65960(10-ethylphenothiazine 5,5-dioxide | SR-01000814044...)
Affinity DataIC50: >5.00E+4nM. Assay description: Data Source (MLPCN Center Name): The Scripps Research Institute Molecular Screening Center (SRIMSC) Center Affiliation: The Scripps Research Institut...
In DepthDetails PCBioAssay