BDBM65996 (6E)-4-nitro-6-[(2-pyridin-2-ylhydrazinyl)methylidene]cyclohexa-2,4-dien-1-one::(6E)-4-nitro-6-[(2-pyridinylhydrazo)methylidene]-1-cyclohexa-2,4-dienone::(6E)-4-nitro-6-[[N'-(2-pyridyl)hydrazino]methylene]cyclohexa-2,4-dien-1-one::2-hydroxy-5-nitrobenzaldehyde pyridin-2-ylhydrazone::MLS000585015::SMR000207397::cid_5722358
SMILES [O-][N+](=O)c1ccc(=O)[c-](C[NH+]=Nc2ccccn2)c1
InChI Key InChIKey=BKJACUSVOHMWAP-UHFFFAOYSA-O
Data  4 IC50  2 EC50
  Tab Delimited (TSV)   2D SDfile   Computed 3D by Vconf -m prep SDfile
Find this compound or compounds like it in BindingDB:
Activity Spreadsheet -- Enzyme Inhibition Constant Data from BindingDB
Found 6 hits for monomerid = 65996
Target60S ribosomal protein L19-A(Saccharomyces cerevisiae)
Nmmlsc
Curated by PubChem BioAssay
LigandPNGBDBM65996((6E)-4-nitro-6-[(2-pyridin-2-ylhydrazinyl)methylid...)
Affinity DataEC50:  1.66E+4nM. Assay description: University of New Mexico Assay Overview: Assay Support: 1R03 MH086450-01 Project Title: Chemical Screen of TOR pathway GFP fusion proteins in S. ...
In DepthDetails PCBioAssay
TargetVacuolar aminopeptidase 1(Saccharomyces cerevisiae)
Nmmlsc
Curated by PubChem BioAssay
LigandPNGBDBM65996((6E)-4-nitro-6-[(2-pyridin-2-ylhydrazinyl)methylid...)
Affinity DataEC50:  1.25E+4nM. Assay description: University of New Mexico Assay Overview: Assay Support: 1R03 MH086450-01 Project Title: Chemical Screen of TOR pathway GFP fusion proteins in S. ...
In DepthDetails PCBioAssay
TargetDisintegrin and metalloproteinase domain-containing protein 17(Homo sapiens (Human))
The Scripps Research Institute Molecular Screening Center
Curated by PubChem BioAssay
LigandPNGBDBM65996((6E)-4-nitro-6-[(2-pyridin-2-ylhydrazinyl)methylid...)
Affinity DataIC50:  9.75E+3nM. Assay description: Source (MLPCN Center Name): The Scripps Research Institute Molecular Screening Center (SRIMSC) Center Affiliation: Torrey Pines Institute for Molecul...
In DepthDetails PCBioAssay
TargetC-C chemokine receptor type 6(Homo sapiens (Human))
Burnham Center For Chemical Genomics
Curated by PubChem BioAssay
LigandPNGBDBM65996((6E)-4-nitro-6-[(2-pyridin-2-ylhydrazinyl)methylid...)
Affinity DataIC50: >6.66E+4nM. Assay description: Data Source: Sanford-Burnham Center for Chemical Genomics (SBCCG) Source Affiliation: Sanford-Burnham Medical Research Institute(SBMRI, San Diego, CA...
In DepthDetails PCBioAssay
TargetDisintegrin and metalloproteinase domain-containing protein 10(Homo sapiens (Human))
The Scripps Research Institute Molecular Screening Center
Curated by PubChem BioAssay
LigandPNGBDBM65996((6E)-4-nitro-6-[(2-pyridin-2-ylhydrazinyl)methylid...)
Affinity DataIC50:  2.75E+4nM. Assay description: Source (MLPCN Center Name): The Scripps Research Institute Molecular Screening Center (SRIMSC) Center Affiliation: Torrey Pines Institute for Molecul...
In DepthDetails PCBioAssay
TargetBeta-galactosidase(Escherichia coli)
Burnham Center For Chemical Genomics
Curated by PubChem BioAssay
LigandPNGBDBM65996((6E)-4-nitro-6-[(2-pyridin-2-ylhydrazinyl)methylid...)
Affinity DataIC50: >6.66E+4nM. Assay description: Data Source: Sanford-Burnham Center for Chemical Genomics (SBCCG) Source Affiliation: Sanford-Burnham Medical Research Institute(SBMRI, San Diego, C...
In DepthDetails PCBioAssay