BDBM66044 4-[1-(hydroxymethyl)-3,5-dioxo-10-oxa-4-azatricyclo[5.2.1.0~2,6~]dec-8-en-4-yl]phenyl acetate::MLS000533582::SMR000141020::[4-[7-(hydroxymethyl)-1,3-bis(oxidanylidene)-4,7a-dihydro-3aH-octahydro-1H-4,7-epoxyisoindol-2-yl]phenyl] ethanoate::[4-[7-(hydroxymethyl)-1,3-dioxo-4,7a-dihydro-3aH-octahydro-1H-4,7-epoxyisoindol-2-yl]phenyl] acetate::acetic acid [4-(1,3-diketo-7-methylol-4,7a-dihydro-3aH-octahydro-1H-4,7-epoxyisoindol-2-yl)phenyl] ester::acetic acid [4-[7-(hydroxymethyl)-1,3-dioxo-4,7a-dihydro-3aH-octahydro-1H-4,7-epoxyisoindol-2-yl]phenyl] ester::cid_2873476
SMILES [H]C12OC(CO)(C=C1)c1c(O)n(c(O)c21)-c1ccc(OC(C)=O)cc1
InChI Key InChIKey=ZBGUMDYNSUSBNP-UHFFFAOYSA-N
Data  1 EC50
  Tab Delimited (TSV)   2D SDfile   Computed 3D by Vconf -m prep SDfile
Find this compound or compounds like it in BindingDB:
Activity Spreadsheet -- Enzyme Inhibition Constant Data from BindingDB
Found 1 hit for monomerid = 66044
TargetVacuolar aminopeptidase 1(Saccharomyces cerevisiae)
Nmmlsc
Curated by PubChem BioAssay
LigandPNGBDBM66044(4-[1-(hydroxymethyl)-3,5-dioxo-10-oxa-4-azatricycl...)
Affinity DataEC50: >3.30E+4nM. Assay description: University of New Mexico Assay Overview: Assay Support: 1R03 MH086450-01 Project Title: Chemical Screen of TOR pathway GFP fusion proteins in S. ...
In DepthDetails PCBioAssay