BDBM66072 4-tert-butyl-N'-(1-pyridin-2-ylethylidene)benzohydrazide::4-tert-butyl-N-(1-pyridin-2-ylethylideneamino)benzamide::4-tert-butyl-N-[1-(2-pyridinyl)ethylideneamino]benzamide::4-tert-butyl-N-[1-(2-pyridyl)ethylideneamino]benzamide::MLS001179619::SMR000476639::cid_902972
SMILES CC(=NNC(=O)c1ccc(cc1)C(C)(C)C)c1ccccn1
InChI Key InChIKey=GSRBRNVBHRBNOC-UHFFFAOYSA-N
Data  2 IC50  1 EC50
  Tab Delimited (TSV)   2D SDfile   Computed 3D by Vconf -m prep SDfile
Find this compound or compounds like it in BindingDB:
Activity Spreadsheet -- Enzyme Inhibition Constant Data from BindingDB
Found 3 hits for monomerid = 66072
TargetVacuolar aminopeptidase 1(Saccharomyces cerevisiae)
Nmmlsc
Curated by PubChem BioAssay
LigandPNGBDBM66072(4-tert-butyl-N'-(1-pyridin-2-ylethylidene)benz...)
Affinity DataEC50:  3.27E+4nM. Assay description: University of New Mexico Assay Overview: Assay Support: 1R03 MH086450-01 Project Title: Chemical Screen of TOR pathway GFP fusion proteins in S. ...
In DepthDetails PCBioAssay
TargetType-1 angiotensin II receptor(Homo sapiens (Human))
Burnham Center For Chemical Genomics
Curated by PubChem BioAssay
LigandPNGBDBM66072(4-tert-butyl-N'-(1-pyridin-2-ylethylidene)benz...)
Affinity DataIC50:  3.48E+3nM. Assay description: Data Source: Sanford-Burnham Center for Chemical Genomics (SBCCG) Source Affiliation: Sanford-Burnham Medical Research Institute(SBMRI, San Diego, C...
In DepthDetails PCBioAssay
TargetApelin receptor(Homo sapiens (Human))
Sanford-Burnham Center For Chemical Genomics
Curated by PubChem BioAssay
LigandPNGBDBM66072(4-tert-butyl-N'-(1-pyridin-2-ylethylidene)benz...)
Affinity DataIC50:  1.90E+3nM. Assay description: Data Source: Sanford-Burnham Center for Chemical Genomics (SBCCG) Source Affiliation: Sanford- Sanford-Burnham Medical Research Institute(SBMRI, San...
In DepthDetails PCBioAssay