BDBM66080 3-(2-aminophenyl)-1-phenyl-2-propyn-1-one::3-(2-aminophenyl)-1-phenyl-prop-2-yn-1-one::3-(2-aminophenyl)-1-phenylprop-2-yn-1-one::MLS001198191::SMR000559341::cid_1504002
SMILES Nc1ccccc1C#CC(=O)c1ccccc1
InChI Key InChIKey=XHHRZTKNLFQIHL-UHFFFAOYSA-N
Data  2 EC50
  Tab Delimited (TSV)   2D SDfile   Computed 3D by Vconf -m prep SDfile
Find this compound or compounds like it in BindingDB:
Activity Spreadsheet -- Enzyme Inhibition Constant Data from BindingDB
Found 2 hits for monomerid = 66080
TargetNeurotensin receptor type 1(Homo sapiens (Human))
Burnham Center For Chemical Genomics
Curated by PubChem BioAssay
LigandPNGBDBM66080(3-(2-aminophenyl)-1-phenyl-2-propyn-1-one | 3-(2-a...)
Affinity DataEC50:  8.09E+3nM. Assay description: Data Source: Sanford-Burnham Center for Chemical Genomics (SBCCG) Source Affiliation: Sanford-Burnham Medical Research Institute (SBMRI, San Diego, C...
In DepthDetails PCBioAssay
TargetVacuolar aminopeptidase 1(Saccharomyces cerevisiae)
Nmmlsc
Curated by PubChem BioAssay
LigandPNGBDBM66080(3-(2-aminophenyl)-1-phenyl-2-propyn-1-one | 3-(2-a...)
Affinity DataEC50:  8.31E+3nM. Assay description: University of New Mexico Assay Overview: Assay Support: 1R03 MH086450-01 Project Title: Chemical Screen of TOR pathway GFP fusion proteins in S. ...
In DepthDetails PCBioAssay