BDBM66097 3,7-diazido-10-methyl-phenothiazine::3,7-diazido-10-methylphenothiazine::SR-03000001199::SR-03000001199-1::cid_44825233
SMILES C[n+]1c2ccc(cc2sc2c\c(ccc12)=N\N=[N-])N=[N+]=[N-]
InChI Key InChIKey=WZUFSIJDQZWDAE-UHFFFAOYSA-N
Data  1 IC50
  Tab Delimited (TSV)   2D SDfile   Computed 3D by Vconf -m prep SDfile
Find this compound or compounds like it in BindingDB:
Activity Spreadsheet -- Enzyme Inhibition Constant Data from BindingDB
Found 1 hit for monomerid = 66097
TargetNADPH oxidase 1(Homo sapiens (Human))
The Scripps Research Institute Molecular Screening Center
Curated by PubChem BioAssay
LigandPNGBDBM66097(3,7-diazido-10-methyl-phenothiazine | 3,7-diazido-...)
Affinity DataIC50:  7.05E+3nM. Assay description: Data Source (MLPCN Center Name): The Scripps Research Institute Molecular Screening Center (SRIMSC) Center Affiliation: The Scripps Research Institut...
In DepthDetails PCBioAssay