BDBM66110 3,7-bis(chloranyl)-N-(3-imidazol-1-ylpropyl)-6-methoxy-1-benzothiophene-2-carboxamide::3,7-dichloro-N-(3-imidazol-1-ylpropyl)-6-methoxy-1-benzothiophene-2-carboxamide::3,7-dichloro-N-(3-imidazol-1-ylpropyl)-6-methoxy-benzothiophene-2-carboxamide::3,7-dichloro-N-[3-(1-imidazolyl)propyl]-6-methoxy-1-benzothiophene-2-carboxamide::MLS000567145::SMR000153947::cid_4878538
SMILES COc1ccc2c(Cl)c(sc2c1Cl)C(=O)NCCCn1ccnc1
InChI Key InChIKey=BPJWQGNYCMLEST-UHFFFAOYSA-N
Data  3 IC50
  Tab Delimited (TSV)   2D SDfile   Computed 3D by Vconf -m prep SDfile
Find this compound or compounds like it in BindingDB:
Activity Spreadsheet -- Enzyme Inhibition Constant Data from BindingDB
Found 3 hits for monomerid = 66110
TargetBeta-lactamase(Pseudomonas aeruginosa)
The Scripps Research Institute Molecular Screening Center
Curated by PubChem BioAssay
LigandPNGBDBM66110(3,7-bis(chloranyl)-N-(3-imidazol-1-ylpropyl)-6-met...)
Affinity DataIC50: >5.96E+4nM. Assay description: Source (MLPCN Center Name): The Scripps Research Institute Molecular Screening Center (SRIMSC) Center Affiliation: The Scripps Research Institute (TS...
In DepthDetails PCBioAssay
TargetBeta-lactamase(Pseudomonas aeruginosa)
The Scripps Research Institute Molecular Screening Center
Curated by PubChem BioAssay
LigandPNGBDBM66110(3,7-bis(chloranyl)-N-(3-imidazol-1-ylpropyl)-6-met...)
Affinity DataIC50: >5.96E+4nM. Assay description: Source (MLPCN Center Name): The Scripps Research Institute Molecular Screening Center (SRIMSC) Center Affiliation: The Scripps Research Institute (TS...
In DepthDetails PCBioAssay
TargetBeta-lactamase(Salmonella enterica subsp. enterica serovar Choler...)
The Scripps Research Institute Molecular Screening Center
Curated by PubChem BioAssay
LigandPNGBDBM66110(3,7-bis(chloranyl)-N-(3-imidazol-1-ylpropyl)-6-met...)
Affinity DataIC50: >5.96E+4nM. Assay description: Source (MLPCN Center Name): The Scripps Research Institute Molecular Screening Center (SRIMSC) Center Affiliation: The Scripps Research Institute (TS...
In DepthDetails PCBioAssay