BDBM66142 1-(4-amino-1,2,5-oxadiazol-3-yl)-N-[1-(4-methoxyphenyl)ethylideneamino]-5-phenyl-4-triazolecarboxamide::1-(4-amino-1,2,5-oxadiazol-3-yl)-N-[1-(4-methoxyphenyl)ethylideneamino]-5-phenyltriazole-4-carboxamide::1-(4-aminofurazan-3-yl)-N-[(E)-1-(4-methoxyphenyl)ethylideneamino]-5-phenyl-triazole-4-carboxamide::1-(4-aminofurazan-3-yl)-N-[1-(4-methoxyphenyl)ethylideneamino]-5-phenyl-triazole-4-carboxamide::1-(4-azanyl-1,2,5-oxadiazol-3-yl)-N-[1-(4-methoxyphenyl)ethylideneamino]-5-phenyl-1,2,3-triazole-4-carboxamide::MLS000912172::SMR000619660::cid_24789527
SMILES COc1ccc(cc1)C(C)=NNC(=O)c1nnn(-c2nonc2N)c1-c1ccccc1
InChI Key InChIKey=WBEJUIIUYNERAB-UHFFFAOYSA-N
Data  7 IC50
  Tab Delimited (TSV)   2D SDfile   Computed 3D by Vconf -m prep SDfile
Find this compound or compounds like it in BindingDB:
Activity Spreadsheet -- Enzyme Inhibition Constant Data from BindingDB
Found 7 hits for monomerid = 66142
TargetBeta-lactamase(Pseudomonas aeruginosa)
The Scripps Research Institute Molecular Screening Center
Curated by PubChem BioAssay
LigandPNGBDBM66142(1-(4-amino-1,2,5-oxadiazol-3-yl)-N-[1-(4-methoxyph...)
Affinity DataIC50: >5.96E+4nM. Assay description: Source (MLPCN Center Name): The Scripps Research Institute Molecular Screening Center (SRIMSC) Center Affiliation: The Scripps Research Institute (TS...
In DepthDetails PCBioAssay
TargetBeta-lactamase(Salmonella enterica subsp. enterica serovar Choler...)
The Scripps Research Institute Molecular Screening Center
Curated by PubChem BioAssay
LigandPNGBDBM66142(1-(4-amino-1,2,5-oxadiazol-3-yl)-N-[1-(4-methoxyph...)
Affinity DataIC50: >5.96E+4nM. Assay description: Source (MLPCN Center Name): The Scripps Research Institute Molecular Screening Center (SRIMSC) Center Affiliation: The Scripps Research Institute (TS...
In DepthDetails PCBioAssay
TargetBeta-lactamase(Pseudomonas aeruginosa)
The Scripps Research Institute Molecular Screening Center
Curated by PubChem BioAssay
LigandPNGBDBM66142(1-(4-amino-1,2,5-oxadiazol-3-yl)-N-[1-(4-methoxyph...)
Affinity DataIC50: >5.96E+4nM. Assay description: Source (MLPCN Center Name): The Scripps Research Institute Molecular Screening Center (SRIMSC) Center Affiliation: The Scripps Research Institute (TS...
In DepthDetails PCBioAssay
TargetLow molecular weight phosphotyrosine protein phosphatase(Homo sapiens (Human))
Burnham Center For Chemical Genomics
Curated by PubChem BioAssay
LigandPNGBDBM66142(1-(4-amino-1,2,5-oxadiazol-3-yl)-N-[1-(4-methoxyph...)
Affinity DataIC50: >8.00E+4nM
In DepthDetails PCBioAssay
Target26S proteasome non-ATPase regulatory subunit 14(Homo sapiens (Human))
Burnham Center For Chemical Genomics
Curated by PubChem BioAssay
LigandPNGBDBM66142(1-(4-amino-1,2,5-oxadiazol-3-yl)-N-[1-(4-methoxyph...)
Affinity DataIC50:  3.02E+4nM. Assay description: Data Source: Sanford-Burnham Center for Chemical Genomics (SBCCG) Source Affiliation: Sanford Burnham Medical Research Institute (SBMRI, La Jolla, CA...
In DepthDetails PCBioAssay
TargetLow molecular weight phosphotyrosine protein phosphatase(Homo sapiens (Human))
Burnham Center For Chemical Genomics
Curated by PubChem BioAssay
LigandPNGBDBM66142(1-(4-amino-1,2,5-oxadiazol-3-yl)-N-[1-(4-methoxyph...)
Affinity DataIC50:  3.52E+4nM
In DepthDetails PCBioAssay
TargetProthrombin(Bos taurus (Bovine))
Burnham Center For Chemical Genomics
Curated by PubChem BioAssay
LigandPNGBDBM66142(1-(4-amino-1,2,5-oxadiazol-3-yl)-N-[1-(4-methoxyph...)
Affinity DataIC50: >1.00E+5nM. Assay description: Data Source: Sanford-Burnham Center for Chemical Genomics (SBCCG) Source Affiliation: Sanford Burnham Medical Research Institute (SBMRI, La Jolla, CA...
In DepthDetails PCBioAssay