BDBM66181 2-[(6,8-dibromo-4-keto-1H-quinazolin-2-yl)methyl-ethyl-amino]-N-isopropyl-acetamide::2-[(6,8-dibromo-4-oxo-1H-quinazolin-2-yl)methyl-ethylamino]-N-propan-2-ylacetamide::2-[[6,8-bis(bromanyl)-4-oxidanylidene-1H-quinazolin-2-yl]methyl-ethyl-amino]-N-propan-2-yl-ethanamide::MLS000760225::SMR000368642::cid_2505717
SMILES CCN(CC(=O)NC(C)C)Cc1nc2c(Br)cc(Br)cc2c(=O)[nH]1
InChI Key InChIKey=NNTFNPBPNRHFFO-UHFFFAOYSA-N
Data  2 IC50
  Tab Delimited (TSV)   2D SDfile   Computed 3D by Vconf -m prep SDfile
Find this compound or compounds like it in BindingDB:
Activity Spreadsheet -- Enzyme Inhibition Constant Data from BindingDB
Found 2 hits for monomerid = 66181
TargetIsoform 2 of Nuclear receptor corepressor 2 (TRAC-1)(Homo sapiens (Human))
The Scripps Research Institute Molecular Screening Center
Curated by PubChem BioAssay
LigandPNGBDBM66181(2-[(6,8-dibromo-4-keto-1H-quinazolin-2-yl)methyl-e...)
Affinity DataIC50:  2.43E+3nM. Assay description: Source (MLPCN Center Name): The Scripps Research Institute Molecular Screening Center Affiliation: The Scripps Research Institute, TSRI Assay Provide...
In DepthDetails PCBioAssay
TargetPhotoreceptor-specific nuclear receptor(Homo sapiens (Human))
The Scripps Research Institute Molecular Screening Center
Curated by PubChem BioAssay
LigandPNGBDBM66181(2-[(6,8-dibromo-4-keto-1H-quinazolin-2-yl)methyl-e...)
Affinity DataIC50: >3.98E+4nM. Assay description: Source (MLPCN Center Name): The Scripps Research Institute Molecular Screening Center Affiliation: The Scripps Research Institute, TSRI Assay Provide...
In DepthDetails PCBioAssay