BDBM66182 2-[[6,8-bis(bromanyl)-4-oxidanylidene-1H-quinazolin-2-yl]methyl-ethyl-amino]-N-tert-butyl-ethanamide::MLS000774379::N-tert-butyl-2-[(6,8-dibromo-4-keto-1H-quinazolin-2-yl)methyl-ethyl-amino]acetamide::N-tert-butyl-2-[(6,8-dibromo-4-oxo-1H-quinazolin-2-yl)methyl-ethylamino]acetamide::SMR000365430::cid_2562110
SMILES CCN(CC(=O)NC(C)(C)C)Cc1nc2c(Br)cc(Br)cc2c(=O)[nH]1
InChI Key InChIKey=MITYLLUYVYBCRI-UHFFFAOYSA-N
Data  4 IC50
  Tab Delimited (TSV)   2D SDfile   Computed 3D by Vconf -m prep SDfile
Find this compound or compounds like it in BindingDB:
Activity Spreadsheet -- Enzyme Inhibition Constant Data from BindingDB
Found 4 hits for monomerid = 66182
TargetPhotoreceptor-specific nuclear receptor(Homo sapiens (Human))
The Scripps Research Institute Molecular Screening Center
Curated by PubChem BioAssay
LigandPNGBDBM66182(2-[[6,8-bis(bromanyl)-4-oxidanylidene-1H-quinazoli...)
Affinity DataIC50: >3.98E+4nM. Assay description: Source (MLPCN Center Name): The Scripps Research Institute Molecular Screening Center Affiliation: The Scripps Research Institute, TSRI Assay Provide...
In DepthDetails PCBioAssay
TargetC-C chemokine receptor type 6(Homo sapiens (Human))
Burnham Center For Chemical Genomics
Curated by PubChem BioAssay
LigandPNGBDBM66182(2-[[6,8-bis(bromanyl)-4-oxidanylidene-1H-quinazoli...)
Affinity DataIC50:  2.28E+4nM. Assay description: Data Source: Sanford-Burnham Center for Chemical Genomics (SBCCG) Source Affiliation: Sanford-Burnham Medical Research Institute(SBMRI, San Diego, CA...
In DepthDetails PCBioAssay
TargetBeta-galactosidase(Escherichia coli)
Burnham Center For Chemical Genomics
Curated by PubChem BioAssay
LigandPNGBDBM66182(2-[[6,8-bis(bromanyl)-4-oxidanylidene-1H-quinazoli...)
Affinity DataIC50: >6.66E+4nM. Assay description: Data Source: Sanford-Burnham Center for Chemical Genomics (SBCCG) Source Affiliation: Sanford-Burnham Medical Research Institute(SBMRI, San Diego, C...
In DepthDetails PCBioAssay
TargetIsoform 2 of Nuclear receptor corepressor 2 (TRAC-1)(Homo sapiens (Human))
The Scripps Research Institute Molecular Screening Center
Curated by PubChem BioAssay
LigandPNGBDBM66182(2-[[6,8-bis(bromanyl)-4-oxidanylidene-1H-quinazoli...)
Affinity DataIC50:  1.50E+4nM. Assay description: Source (MLPCN Center Name): The Scripps Research Institute Molecular Screening Center Affiliation: The Scripps Research Institute, TSRI Assay Provide...
In DepthDetails PCBioAssay