BDBM66206 3-(1-benzofuran-2-carbonyl)-4-hydroxy-2-(4-methylphenyl)-1-(2-morpholin-4-ylethyl)-2H-pyrrol-5-one::3-(1-benzofuran-2-ylcarbonyl)-2-(4-methylphenyl)-1-(2-morpholin-4-ylethyl)-4-oxidanyl-2H-pyrrol-5-one::3-[2-benzofuranyl(oxo)methyl]-4-hydroxy-2-(4-methylphenyl)-1-[2-(4-morpholinyl)ethyl]-2H-pyrrol-5-one::4-(benzofuran-2-carbonyl)-3-hydroxy-1-(2-morpholinoethyl)-5-(p-tolyl)-3-pyrrolin-2-one::MLS001146433::SMR000646791::cid_3634961
SMILES Cc1ccc(cc1)C1C(C(=O)c2cc3ccccc3o2)C(=O)C(=O)N1CCN1CCOCC1
InChI Key InChIKey=SQUNAVUFMAQNAX-UHFFFAOYSA-N
Data  2 IC50
  Tab Delimited (TSV)   2D SDfile   Computed 3D by Vconf -m prep SDfile
Find this compound or compounds like it in BindingDB:
Activity Spreadsheet -- Enzyme Inhibition Constant Data from BindingDB
Found 2 hits for monomerid = 66206
TargetIsoform 2 of Nuclear receptor corepressor 2 (TRAC-1)(Homo sapiens (Human))
The Scripps Research Institute Molecular Screening Center
Curated by PubChem BioAssay
LigandPNGBDBM66206(3-(1-benzofuran-2-carbonyl)-4-hydroxy-2-(4-methylp...)
Affinity DataIC50:  4.89E+3nM. Assay description: Source (MLPCN Center Name): The Scripps Research Institute Molecular Screening Center Affiliation: The Scripps Research Institute, TSRI Assay Provide...
In DepthDetails PCBioAssay
TargetPhotoreceptor-specific nuclear receptor(Homo sapiens (Human))
The Scripps Research Institute Molecular Screening Center
Curated by PubChem BioAssay
LigandPNGBDBM66206(3-(1-benzofuran-2-carbonyl)-4-hydroxy-2-(4-methylp...)
Affinity DataIC50: >3.98E+4nM. Assay description: Source (MLPCN Center Name): The Scripps Research Institute Molecular Screening Center Affiliation: The Scripps Research Institute, TSRI Assay Provide...
In DepthDetails PCBioAssay