BDBM66208 3-(1-benzofuran-2-carbonyl)-2-(4-chlorophenyl)-4-hydroxy-1-(3-morpholin-4-ylpropyl)-2H-pyrrol-5-one::3-(1-benzofuran-2-ylcarbonyl)-2-(4-chlorophenyl)-1-(3-morpholin-4-ylpropyl)-4-oxidanyl-2H-pyrrol-5-one::3-[2-benzofuranyl(oxo)methyl]-2-(4-chlorophenyl)-4-hydroxy-1-[3-(4-morpholinyl)propyl]-2H-pyrrol-5-one::4-(benzofuran-2-carbonyl)-5-(4-chlorophenyl)-3-hydroxy-1-(3-morpholinopropyl)-3-pyrrolin-2-one::MLS001146423::SMR000646790::cid_3793964
SMILES Clc1ccc(cc1)C1C(C(=O)c2cc3ccccc3o2)C(=O)C(=O)N1CCCN1CCOCC1
InChI Key InChIKey=LVAYFGCBGZQRPH-UHFFFAOYSA-N
Data  2 IC50
  Tab Delimited (TSV)   2D SDfile   Computed 3D by Vconf -m prep SDfile
Find this compound or compounds like it in BindingDB:
Activity Spreadsheet -- Enzyme Inhibition Constant Data from BindingDB
Found 2 hits for monomerid = 66208
TargetIsoform 2 of Nuclear receptor corepressor 2 (TRAC-1)(Homo sapiens (Human))
The Scripps Research Institute Molecular Screening Center
Curated by PubChem BioAssay
LigandPNGBDBM66208(3-(1-benzofuran-2-carbonyl)-2-(4-chlorophenyl)-4-h...)
Affinity DataIC50:  5.14E+3nM. Assay description: Source (MLPCN Center Name): The Scripps Research Institute Molecular Screening Center Affiliation: The Scripps Research Institute, TSRI Assay Provide...
In DepthDetails PCBioAssay
TargetPhotoreceptor-specific nuclear receptor(Homo sapiens (Human))
The Scripps Research Institute Molecular Screening Center
Curated by PubChem BioAssay
LigandPNGBDBM66208(3-(1-benzofuran-2-carbonyl)-2-(4-chlorophenyl)-4-h...)
Affinity DataIC50: >3.98E+4nM. Assay description: Source (MLPCN Center Name): The Scripps Research Institute Molecular Screening Center Affiliation: The Scripps Research Institute, TSRI Assay Provide...
In DepthDetails PCBioAssay