BDBM66409 3-bromanyl-N-(fluoren-9-ylideneamino)benzamide::3-bromo-N'-9H-fluoren-9-ylidenebenzohydrazide::3-bromo-N-(9-fluorenylideneamino)benzamide::3-bromo-N-(fluoren-9-ylideneamino)benzamide::MLS000576036::SMR000185776::cid_2244730
SMILES Brc1cccc(c1)-[#6](=O)-[#7]\[#7]=[#6]-1\c2ccccc2-c2ccccc-12
InChI Key InChIKey=IXDPBJGHJPDOSH-UHFFFAOYSA-N
Data  1 EC50
  Tab Delimited (TSV)   2D SDfile   Computed 3D by Vconf -m prep SDfile
Find this compound or compounds like it in BindingDB:
Activity Spreadsheet -- Enzyme Inhibition Constant Data from BindingDB
Found 1 hit for monomerid = 66409
TargetBcl-2-like protein 11(Homo sapiens (Human))
Broad Institute
Curated by PubChem BioAssay
LigandPNGBDBM66409(3-bromanyl-N-(fluoren-9-ylideneamino)benzamide | 3...)
Affinity DataEC50:  5.17E+4nM. Assay description: Keywords: apoptosis, BH3 domain, Bcl2-A1, BIM, caspase, cancer Primary Collaborator: Todd Golub, Broad Institute, golub@broadinstitute.org Assay Over...
In DepthDetails PCBioAssay