BDBM66673 2-amino-6-(4-chlorophenyl)sulfanyl-4-(4-methoxyphenyl)pyridine-3,5-dicarbonitrile::2-amino-6-[(4-chlorophenyl)thio]-4-(4-methoxyphenyl)dinicotinonitrile::2-amino-6-[(4-chlorophenyl)thio]-4-(4-methoxyphenyl)pyridine-3,5-dicarbonitrile::2-azanyl-6-(4-chlorophenyl)sulfanyl-4-(4-methoxyphenyl)pyridine-3,5-dicarbonitrile::MLS000859091::SMR000459270::cid_2818996
SMILES COc1ccc(cc1)-c1c(C#N)c(N)nc(Sc2ccc(Cl)cc2)c1C#N
InChI Key InChIKey=MKNXICMRXZJQQV-UHFFFAOYSA-N
Data  3 IC50  1 EC50
  Tab Delimited (TSV)   2D SDfile   Computed 3D by Vconf -m prep SDfile
Find this compound or compounds like it in BindingDB:
Activity Spreadsheet -- Enzyme Inhibition Constant Data from BindingDB
Found 4 hits for monomerid = 66673
TargetBcl-2-like protein 11(Homo sapiens (Human))
Broad Institute
Curated by PubChem BioAssay
LigandPNGBDBM66673(2-amino-6-(4-chlorophenyl)sulfanyl-4-(4-methoxyphe...)
Affinity DataEC50:  9.60E+4nM. Assay description: Keywords: apoptosis, BH3 domain, Bcl2-A1, BIM, caspase, cancer Primary Collaborator: Todd Golub, Broad Institute, golub@broadinstitute.org Assay Over...
In DepthDetails PCBioAssay
TargetEnvelope glycoprotein gp160(Human immunodeficiency virus type 1 group M subtyp...)
The Scripps Research Institute Molecular Screening Center
Curated by PubChem BioAssay
LigandPNGBDBM66673(2-amino-6-(4-chlorophenyl)sulfanyl-4-(4-methoxyphe...)
Affinity DataIC50:  4.87E+3nM
In DepthDetails PCBioAssay
TargetEnvelope glycoprotein gp160(Human immunodeficiency virus type 1 group M subtyp...)
The Scripps Research Institute Molecular Screening Center
Curated by PubChem BioAssay
LigandPNGBDBM66673(2-amino-6-(4-chlorophenyl)sulfanyl-4-(4-methoxyphe...)
Affinity DataIC50:  4.38E+3nM
In DepthDetails PCBioAssay
TargetEnvelope glycoprotein gp160(Human immunodeficiency virus type 1 group M subtyp...)
The Scripps Research Institute Molecular Screening Center
Curated by PubChem BioAssay
LigandPNGBDBM66673(2-amino-6-(4-chlorophenyl)sulfanyl-4-(4-methoxyphe...)
Affinity DataIC50:  8.49E+3nM
In DepthDetails PCBioAssay