BDBM67138 3-[[5-(4-chlorophenyl)-1,3,4-oxadiazol-2-yl]methyl]-6,7-dimethoxy-2-(4-morpholinylmethylidene)-1H-quinazolin-4-one::3-[[5-(4-chlorophenyl)-1,3,4-oxadiazol-2-yl]methyl]-6,7-dimethoxy-2-(morpholin-4-ylmethylidene)-1H-quinazolin-4-one::3-[[5-(4-chlorophenyl)-1,3,4-oxadiazol-2-yl]methyl]-6,7-dimethoxy-2-(morpholinomethylene)-1H-quinazolin-4-one::SR-03000001030-1::cid_44202996
SMILES COc1cc2nc(CN3CCOCC3)n(Cc3nnc(o3)-c3ccc(Cl)cc3)c(=O)c2cc1OC
InChI Key InChIKey=MIFDHNGLWHIPER-UHFFFAOYSA-N
Data  2 IC50
  Tab Delimited (TSV)   2D SDfile   Computed 3D by Vconf -m prep SDfile
Find this compound or compounds like it in BindingDB:
Activity Spreadsheet -- Enzyme Inhibition Constant Data from BindingDB
Found 2 hits for monomerid = 67138
TargetSignal transducer and activator of transcription 1-alpha/beta(Homo sapiens (Human))
The Scripps Research Institute Molecular Screening Center
Curated by PubChem BioAssay
LigandPNGBDBM67138(3-[[5-(4-chlorophenyl)-1,3,4-oxadiazol-2-yl]methyl...)
Affinity DataIC50: >5.57E+4nM. Assay description: Source (MLPCN Center Name): The Scripps Research Institute Molecular Screening Center Center Affiliation: The Scripps Research Institute (TSRI) Assay...
In DepthDetails PCBioAssay
TargetSignal transducer and activator of transcription 3 [702-738,740-752](Homo sapiens (Human))
The Scripps Research Institute Molecular Screening Center
Curated by PubChem BioAssay
LigandPNGBDBM67138(3-[[5-(4-chlorophenyl)-1,3,4-oxadiazol-2-yl]methyl...)
Affinity DataIC50: >5.57E+4nM. Assay description: Source (MLPCN Center Name): The Scripps Research Institute Molecular Screening Center Center Affiliation: The Scripps Research Institute (TSRI) Assay...
In DepthDetails PCBioAssay