BDBM67141 3-[(4-tert-butyl-1,3-thiazol-2-yl)methyl]-2-[(dimethylamino)methyl]quinazolin-4-one::3-[(4-tert-butyl-2-thiazolyl)methyl]-2-[(dimethylamino)methyl]-4-quinazolinone::3-[(4-tert-butylthiazol-2-yl)methyl]-2-[(dimethylamino)methyl]quinazolin-4-one::SR-01000617469::SR-01000617469-2::cid_2104885
SMILES CN(C)Cc1nc2ccccc2c(=O)n1Cc1nc(cs1)C(C)(C)C
InChI Key InChIKey=IYYWVEYNNZCCFO-UHFFFAOYSA-N
Data  2 IC50
  Tab Delimited (TSV)   2D SDfile   Computed 3D by Vconf -m prep SDfile
Find this compound or compounds like it in BindingDB:
Activity Spreadsheet -- Enzyme Inhibition Constant Data from BindingDB
Found 2 hits for monomerid = 67141
TargetSignal transducer and activator of transcription 1-alpha/beta(Homo sapiens (Human))
The Scripps Research Institute Molecular Screening Center
Curated by PubChem BioAssay
LigandPNGBDBM67141(3-[(4-tert-butyl-1,3-thiazol-2-yl)methyl]-2-[(dime...)
Affinity DataIC50:  2.80E+4nM. Assay description: Source (MLPCN Center Name): The Scripps Research Institute Molecular Screening Center Center Affiliation: The Scripps Research Institute (TSRI) Assay...
In DepthDetails PCBioAssay
TargetSignal transducer and activator of transcription 3 [702-738,740-752](Homo sapiens (Human))
The Scripps Research Institute Molecular Screening Center
Curated by PubChem BioAssay
LigandPNGBDBM67141(3-[(4-tert-butyl-1,3-thiazol-2-yl)methyl]-2-[(dime...)
Affinity DataIC50: >5.57E+4nM. Assay description: Source (MLPCN Center Name): The Scripps Research Institute Molecular Screening Center Center Affiliation: The Scripps Research Institute (TSRI) Assay...
In DepthDetails PCBioAssay