BDBM67146 (7-amino-10-methyl-3-phenothiazinyl)-phenylmethanone::(7-amino-10-methyl-phenothiazin-3-yl)-phenyl-methanone::(7-amino-10-methylphenothiazin-3-yl)-phenylmethanone::(7-azanyl-10-methyl-phenothiazin-3-yl)-phenyl-methanone::SR-03000001210::SR-03000001210-1::cid_44968124
SMILES CN1c2ccc(N)cc2Sc2cc(ccc12)C(=O)c1ccccc1
InChI Key InChIKey=HPEOOBSXTJPSHW-UHFFFAOYSA-N
Data  1 IC50
  Tab Delimited (TSV)   2D SDfile   Computed 3D by Vconf -m prep SDfile
Find this compound or compounds like it in BindingDB:
Activity Spreadsheet -- Enzyme Inhibition Constant Data from BindingDB
Found 1 hit for monomerid = 67146
TargetNADPH oxidase 1(Homo sapiens (Human))
The Scripps Research Institute Molecular Screening Center
Curated by PubChem BioAssay
LigandPNGBDBM67146((7-amino-10-methyl-3-phenothiazinyl)-phenylmethano...)
Affinity DataIC50:  201nM. Assay description: Data Source (MLPCN Center Name): The Scripps Research Institute Molecular Screening Center (SRIMSC) Center Affiliation: The Scripps Research Institut...
In DepthDetails PCBioAssay