BDBM67417 4-(2-aminobenzimidazol-1-yl)sulfonylbenzonitrile::4-(2-azanylbenzimidazol-1-yl)sulfonylbenzenecarbonitrile::4-[(2-amino-1-benzimidazolyl)sulfonyl]benzonitrile::MLS-0435787.0001::cid_45253884
SMILES Nc1nc2ccccc2n1S(=O)(=O)c1ccc(cc1)C#N
InChI Key InChIKey=ALNOHXHHABYTFA-UHFFFAOYSA-N
Data  3 IC50
  Tab Delimited (TSV)   2D SDfile   Computed 3D by Vconf -m prep SDfile
Find this compound or compounds like it in BindingDB:
Activity Spreadsheet -- Enzyme Inhibition Constant Data from BindingDB
Found 3 hits for monomerid = 67417
TargetNucleotide-binding oligomerization domain-containing protein 1(Homo sapiens (Human))
Burnham Center For Chemical Genomics
Curated by PubChem BioAssay
LigandPNGBDBM67417(4-(2-aminobenzimidazol-1-yl)sulfonylbenzonitrile |...)
Affinity DataIC50: >2.00E+4nM. Assay description: Data Source: Sanford-Burnham Center for Chemical Genomics (SBCCG) Source Affiliation: Sanford-Burnham Medical Research Institute (SBMRI, San Diego, C...
In DepthDetails PCBioAssay
TargetTumor necrosis factor(Homo sapiens (Human))
Burnham Center For Chemical Genomics
Curated by PubChem BioAssay
LigandPNGBDBM67417(4-(2-aminobenzimidazol-1-yl)sulfonylbenzonitrile |...)
Affinity DataIC50: >2.00E+4nM. Assay description: Data Source: Sanford-Burnham Center for Chemical Genomics (SBCCG) Source Affiliation: Sanford-Burnham Medical Research Institute (SBMRI, San Diego, C...
In DepthDetails PCBioAssay
TargetNucleotide-binding oligomerization domain-containing protein 2(Homo sapiens (Human))
Burnham Center For Chemical Genomics
Curated by PubChem BioAssay
LigandPNGBDBM67417(4-(2-aminobenzimidazol-1-yl)sulfonylbenzonitrile |...)
Affinity DataIC50: >2.00E+4nM. Assay description: Data Source: Sanford-Burnham Center for Chemical Genomics (SBCCG) Source Affiliation: Sanford-Burnham Medical Research Institute (SBMRI, San Diego, C...
In DepthDetails PCBioAssay