BDBM67426 1-[(Benzyl-phenyl-carbamoyl)-methyl]-4-methyl-1,4-dihydro-pyrrolo[3,2-b]pyrrole-2-carboxylic acid ethyl ester::1-methyl-4-[2-oxo-2-(N-(phenylmethyl)anilino)ethyl]-5-pyrrolo[3,2-b]pyrrolecarboxylic acid ethyl ester::4-[2-(N-benzylanilino)-2-keto-ethyl]-1-methyl-pyrrolo[3,2-b]pyrrole-5-carboxylic acid ethyl ester::MLS000559692::SMR000173659::cid_1438832::ethyl 1-methyl-4-[2-oxidanylidene-2-[phenyl-(phenylmethyl)amino]ethyl]pyrrolo[3,2-b]pyrrole-5-carboxylate::ethyl 4-[2-(N-benzylanilino)-2-oxoethyl]-1-methylpyrrolo[3,2-b]pyrrole-5-carboxylate
SMILES CCOC(=O)c1cc2n(C)ccc2n1CC(=O)N(Cc1ccccc1)c1ccccc1
InChI Key InChIKey=HGILOFNKMNTKEU-UHFFFAOYSA-N
Data  2 IC50
  Tab Delimited (TSV)   2D SDfile   Computed 3D by Vconf -m prep SDfile
Find this compound or compounds like it in BindingDB:
Activity Spreadsheet -- Enzyme Inhibition Constant Data from BindingDB
Found 2 hits for monomerid = 67426
TargetFemale germline-specific tumor suppressor gld-1(Caenorhabditis elegans)
The Scripps Research Institute Molecular Screening Center
Curated by PubChem BioAssay
LigandPNGBDBM67426(1-[(Benzyl-phenyl-carbamoyl)-methyl]-4-methyl-1,4-...)
Affinity DataIC50: >6.62E+3nM. Assay description: Source (MLPCN Center Name): The Scripps Research Institute Molecular Screening Center (SRIMSC) Affiliation: The Scripps Research Institute, TSRI Assa...
In DepthDetails PCBioAssay
TargetProtein Rev(Human immunodeficiency virus 1)
The Scripps Research Institute Molecular Screening Center
Curated by PubChem BioAssay
LigandPNGBDBM67426(1-[(Benzyl-phenyl-carbamoyl)-methyl]-4-methyl-1,4-...)
Affinity DataIC50: >7.54E+4nM. Assay description: Source (MLPCN Center Name): The Scripps Research Institute Molecular Screening Center (SRIMSC) Affiliation: The Scripps Research Institute, TSRI Assa...
In DepthDetails PCBioAssay