BDBM67440 4-(3-bromo-5-ethoxy-4-hydroxy-phenyl)-1-cyclopentyl-4H-pyridine-3,5-dicarboxylic acid dimethyl ester::4-(3-bromo-5-ethoxy-4-hydroxyphenyl)-1-cyclopentyl-4H-pyridine-3,5-dicarboxylic acid dimethyl ester::MLS000911026::SMR000073919::cid_1313404::dimethyl 4-(3-bromanyl-5-ethoxy-4-oxidanyl-phenyl)-1-cyclopentyl-4H-pyridine-3,5-dicarboxylate::dimethyl 4-(3-bromo-5-ethoxy-4-hydroxyphenyl)-1-cyclopentyl-1,4-dihydro-3,5-pyridinedicarboxylate::dimethyl 4-(3-bromo-5-ethoxy-4-hydroxyphenyl)-1-cyclopentyl-4H-pyridine-3,5-dicarboxylate
SMILES CCOc1cc(cc(Br)c1O)C1C(=CN(C=C1C(=O)OC)C1CCCC1)C(=O)OC
InChI Key InChIKey=VMTZICDEGRLTAG-UHFFFAOYSA-N
Data  2 IC50  1 EC50
  Tab Delimited (TSV)   2D SDfile   Computed 3D by Vconf -m prep SDfile
Find this compound or compounds like it in BindingDB:
Activity Spreadsheet -- Enzyme Inhibition Constant Data from BindingDB
Found 3 hits for monomerid = 67440
TargetProtein Rev(Human immunodeficiency virus 1)
The Scripps Research Institute Molecular Screening Center
Curated by PubChem BioAssay
LigandPNGBDBM67440(4-(3-bromo-5-ethoxy-4-hydroxy-phenyl)-1-cyclopenty...)
Affinity DataIC50: >7.54E+4nM. Assay description: Source (MLPCN Center Name): The Scripps Research Institute Molecular Screening Center (SRIMSC) Affiliation: The Scripps Research Institute, TSRI Assa...
In DepthDetails PCBioAssay
TargetCorticotropin-releasing factor-binding protein(Homo sapiens (Human))
Burnham Center For Chemical Genomics
Curated by PubChem BioAssay
LigandPNGBDBM67440(4-(3-bromo-5-ethoxy-4-hydroxy-phenyl)-1-cyclopenty...)
Affinity DataEC50: >5.30E+4nM. Assay description: Data Source: Sanford-Burnham Center for Chemical Genomics (SBCCG) Source Affiliation: Sanford-Burnham Medical Research Institute (SBMRI, San Diego, C...
In DepthDetails PCBioAssay
TargetFemale germline-specific tumor suppressor gld-1(Caenorhabditis elegans)
The Scripps Research Institute Molecular Screening Center
Curated by PubChem BioAssay
LigandPNGBDBM67440(4-(3-bromo-5-ethoxy-4-hydroxy-phenyl)-1-cyclopenty...)
Affinity DataIC50: >5.96E+4nM. Assay description: Source (MLPCN Center Name): The Scripps Research Institute Molecular Screening Center (SRIMSC) Affiliation: The Scripps Research Institute, TSRI Assa...
In DepthDetails PCBioAssay