BDBM67486 2-chloranyl-7-(4-methylphenyl)sulfonyl-10H-phenothiazine::2-chloro-7-(4-methylphenyl)sulfonyl-10H-phenothiazine::2-chloro-7-tosyl-10H-phenothiazine::SR-03000000707-1::cid_2337278
SMILES Cc1ccc(cc1)S(=O)(=O)c1ccc2Nc3cc(Cl)ccc3Sc2c1
InChI Key InChIKey=CDXORNCNZMSXDX-UHFFFAOYSA-N
Data  1 IC50
  Tab Delimited (TSV)   2D SDfile   Computed 3D by Vconf -m prep SDfile
Find this compound or compounds like it in BindingDB:
Activity Spreadsheet -- Enzyme Inhibition Constant Data from BindingDB
Found 1 hit for monomerid = 67486
TargetNADPH oxidase 1(Homo sapiens (Human))
The Scripps Research Institute Molecular Screening Center
Curated by PubChem BioAssay
LigandPNGBDBM67486(2-chloranyl-7-(4-methylphenyl)sulfonyl-10H-phenoth...)
Affinity DataIC50:  5.25E+3nM. Assay description: Data Source (MLPCN Center Name): The Scripps Research Institute Molecular Screening Center (SRIMSC) Center Affiliation: The Scripps Research Institut...
Ligand InfoPC cidPC sid
In DepthDetails PCBioAssay