BDBM67493 2-(3,4-dimethoxyphenyl)-4,5-bis(4-methoxyphenyl)-1H-imidazole::SR-03000000714-1::cid_1036274
SMILES COc1ccc(cc1)-c1nc([nH]c1-c1ccc(OC)cc1)-c1ccc(OC)c(OC)c1
InChI Key InChIKey=BDRQGELSYCMCHD-UHFFFAOYSA-N
Data  1 IC50
  Tab Delimited (TSV)   2D SDfile   Computed 3D by Vconf -m prep SDfile
Find this compound or compounds like it in BindingDB:
Activity Spreadsheet -- Enzyme Inhibition Constant Data from BindingDB
Found 1 hit for monomerid = 67493
TargetNADPH oxidase 1(Homo sapiens (Human))
The Scripps Research Institute Molecular Screening Center
Curated by PubChem BioAssay
LigandPNGBDBM67493(2-(3,4-dimethoxyphenyl)-4,5-bis(4-methoxyphenyl)-1...)
Affinity DataIC50: >1.70E+4nM. Assay description: Data Source (MLPCN Center Name): The Scripps Research Institute Molecular Screening Center (SRIMSC) Center Affiliation: The Scripps Research Institut...
In DepthDetails PCBioAssay