BDBM67508 (4-chlorophenyl) 3-chloranyl-1-benzothiophene-2-carboxylate::(4-chlorophenyl) 3-chloro-1-benzothiophene-2-carboxylate::3-chloro-1-benzothiophene-2-carboxylic acid (4-chlorophenyl) ester::3-chlorobenzothiophene-2-carboxylic acid (4-chlorophenyl) ester::SR-03000000730-1::cid_833497
SMILES Clc1c(sc2ccccc12)C(=O)Oc1ccc(Cl)cc1
InChI Key InChIKey=NYANKWBSPPDSFP-UHFFFAOYSA-N
Data  1 IC50
  Tab Delimited (TSV)   2D SDfile   Computed 3D by Vconf -m prep SDfile
Find this compound or compounds like it in BindingDB:
Activity Spreadsheet -- Enzyme Inhibition Constant Data from BindingDB
Found 1 hit for monomerid = 67508
TargetNADPH oxidase 1(Homo sapiens (Human))
The Scripps Research Institute Molecular Screening Center
Curated by PubChem BioAssay
LigandPNGBDBM67508((4-chlorophenyl) 3-chloranyl-1-benzothiophene-2-ca...)
Affinity DataIC50: >1.70E+4nM. Assay description: Data Source (MLPCN Center Name): The Scripps Research Institute Molecular Screening Center (SRIMSC) Center Affiliation: The Scripps Research Institut...
In DepthDetails PCBioAssay