BDBM67541 (3,5-dichloro-4-pyridyl)-[(E)-[4-(trifluoromethoxy)benzylidene]amino]amine::3,5-bis(chloranyl)-N-[(E)-[4-(trifluoromethyloxy)phenyl]methylideneamino]pyridin-4-amine::3,5-dichloro-N-[(E)-[4-(trifluoromethoxy)phenyl]methylideneamino]-4-pyridinamine::3,5-dichloro-N-[(E)-[4-(trifluoromethoxy)phenyl]methylideneamino]pyridin-4-amine::SR-03000000764-1::cid_9641763
SMILES FC(F)(F)Oc1ccc(CN=Nc2c(Cl)cncc2Cl)cc1
InChI Key InChIKey=MQZXOMJASIOUCG-UHFFFAOYSA-N
Data  1 IC50
  Tab Delimited (TSV)   2D SDfile   Computed 3D by Vconf -m prep SDfile
Find this compound or compounds like it in BindingDB:
Activity Spreadsheet -- Enzyme Inhibition Constant Data from BindingDB
Found 1 hit for monomerid = 67541
TargetNADPH oxidase 1(Homo sapiens (Human))
The Scripps Research Institute Molecular Screening Center
Curated by PubChem BioAssay
LigandPNGBDBM67541((3,5-dichloro-4-pyridyl)-[(E)-[4-(trifluoromethoxy...)
Affinity DataIC50: >1.70E+4nM. Assay description: Data Source (MLPCN Center Name): The Scripps Research Institute Molecular Screening Center (SRIMSC) Center Affiliation: The Scripps Research Institut...
Ligand InfoPC cidPC sid
In DepthDetails PCBioAssay