BDBM67543 2-(4-fluorophenyl)-4,5-diphenyl-1H-imidazole::SR-03000000766-1::cid_800028
SMILES Fc1ccc(cc1)-c1nc(c([nH]1)-c1ccccc1)-c1ccccc1
InChI Key InChIKey=NSXOBUOVKKFIHN-UHFFFAOYSA-N
Data  1 IC50
  Tab Delimited (TSV)   2D SDfile   Computed 3D by Vconf -m prep SDfile
Find this compound or compounds like it in BindingDB:
Activity Spreadsheet -- Enzyme Inhibition Constant Data from BindingDB
Found 1 hit for monomerid = 67543
TargetNADPH oxidase 1(Homo sapiens (Human))
The Scripps Research Institute Molecular Screening Center
Curated by PubChem BioAssay
LigandPNGBDBM67543(2-(4-fluorophenyl)-4,5-diphenyl-1H-imidazole | SR-...)
Affinity DataIC50: >1.70E+4nM. Assay description: Data Source (MLPCN Center Name): The Scripps Research Institute Molecular Screening Center (SRIMSC) Center Affiliation: The Scripps Research Institut...
In DepthDetails PCBioAssay