BDBM67555 2-[N-methyl-4-[(E)-[(2,3,5,6-tetrafluoro-4-pyridinyl)hydrazinylidene]methyl]anilino]ethanol::2-[N-methyl-4-[(E)-[(2,3,5,6-tetrafluoro-4-pyridyl)hydrazono]methyl]anilino]ethanol::2-[N-methyl-4-[(E)-[(2,3,5,6-tetrafluoropyridin-4-yl)hydrazinylidene]methyl]anilino]ethanol::2-[methyl-[4-[(E)-[[2,3,5,6-tetrakis(fluoranyl)pyridin-4-yl]hydrazinylidene]methyl]phenyl]amino]ethanol::SR-03000000889-1::cid_9786406
SMILES CN(CCO)c1ccc(CN=Nc2c(F)c(F)nc(F)c2F)cc1
InChI Key InChIKey=XNOGJZULXQSAIP-UHFFFAOYSA-N
Data  1 IC50
  Tab Delimited (TSV)   2D SDfile   Computed 3D by Vconf -m prep SDfile
Find this compound or compounds like it in BindingDB:
Activity Spreadsheet -- Enzyme Inhibition Constant Data from BindingDB
Found 1 hit for monomerid = 67555
TargetNADPH oxidase 1(Homo sapiens (Human))
The Scripps Research Institute Molecular Screening Center
Curated by PubChem BioAssay
LigandPNGBDBM67555(2-[N-methyl-4-[(E)-[(2,3,5,6-tetrafluoro-4-pyridin...)
Affinity DataIC50:  1.11E+3nM. Assay description: Data Source (MLPCN Center Name): The Scripps Research Institute Molecular Screening Center (SRIMSC) Center Affiliation: The Scripps Research Institut...
Ligand InfoPC cidPC sid
In DepthDetails PCBioAssay