BDBM67619 1-(2,4-dimethylphenyl)-3-(1H-indazol-6-yl)thiourea::MLS000516257::SMR000372925::cid_4233846
SMILES Cc1ccc(NC(=S)Nc2ccc3cn[nH]c3c2)c(C)c1
InChI Key InChIKey=FNXFNQNMGBVWMR-UHFFFAOYSA-N
Data  1 EC50
  Tab Delimited (TSV)   2D SDfile   Computed 3D by Vconf -m prep SDfile
Find this compound or compounds like it in BindingDB:
Activity Spreadsheet -- Enzyme Inhibition Constant Data from BindingDB
Found 1 hit for monomerid = 67619
TargetSerine/threonine-protein kinase 33(Homo sapiens (Human))
Broad Institute
Curated by PubChem BioAssay
LigandPNGBDBM67619(1-(2,4-dimethylphenyl)-3-(1H-indazol-6-yl)thiourea...)
Affinity DataEC50: >1.20E+5nM. Assay description: Keywords: STK33 Kinase, Non-ATP Competitive Inhibitor Assay Overview: Purified STK33 Kinase is preincubated with potential inhibitors and allowed to ...
In DepthDetails PCBioAssay