BDBM68053 3-amino-2-N-(3-chlorophenyl)-4-N-(2-methoxyphenyl)-5-(2-methylanilino)thiophene-2,4-dicarboxamide::3-amino-N-(3-chlorophenyl)-N'-(2-methoxyphenyl)-5-(o-toluidino)thiophene-2,4-dicarboxamide::3-amino-N2-(3-chlorophenyl)-N4-(2-methoxyphenyl)-5-(2-methylanilino)thiophene-2,4-dicarboxamide::3-azanyl-N2-(3-chlorophenyl)-N4-(2-methoxyphenyl)-5-[(2-methylphenyl)amino]thiophene-2,4-dicarboxamide::MLS000394900::SMR000262185::cid_2439674
SMILES COc1ccccc1NC(=O)c1c(N)c(sc1Nc1ccccc1C)C(=O)Nc1cccc(Cl)c1
InChI Key InChIKey=RGMBRQQTDUXHPX-UHFFFAOYSA-N
Data  8 IC50
  Tab Delimited (TSV)   2D SDfile   Computed 3D by Vconf -m prep SDfile
Find this compound or compounds like it in BindingDB:
Activity Spreadsheet -- Enzyme Inhibition Constant Data from BindingDB
Found 8 hits for monomerid = 68053
TargetDNA damage-inducible transcript 3 protein(Mus musculus)
Emory University
Curated by PubChem BioAssay
LigandPNGBDBM68053(3-amino-2-N-(3-chlorophenyl)-4-N-(2-methoxyphenyl)...)
Affinity DataIC50:  2.59E+3nM. Assay description: NIH Molecular Libraries Screening Centers Network [MLSCN] Emory Chemical Biology Discovery Center in MLSCN Assay provider: Dr. Randal Kaufman, Univer...
In DepthDetails PCBioAssay
TargetX-box-binding protein 1(Homo sapiens (Human))
Emory University
Curated by PubChem BioAssay
LigandPNGBDBM68053(3-amino-2-N-(3-chlorophenyl)-4-N-(2-methoxyphenyl)...)
Affinity DataIC50:  5.03E+3nM. Assay description: NIH Molecular Libraries Screening Centers Network [MLSCN] Emory Chemical Biology Discovery Center in MLSCN Assay provider: Dr. Randal Kaufman, Univer...
In DepthDetails PCBioAssay
TargetDNA damage-inducible transcript 3 protein(Mus musculus)
Emory University
Curated by PubChem BioAssay
LigandPNGBDBM68053(3-amino-2-N-(3-chlorophenyl)-4-N-(2-methoxyphenyl)...)
Affinity DataIC50:  2.59E+3nM. Assay description: NIH Molecular Libraries Screening Centers Network [MLSCN] Emory Chemical Biology Discovery Center in MLSCN Assay provider: Dr. Randal Kaufman, Univer...
In DepthDetails PCBioAssay
TargetDisintegrin and metalloproteinase domain-containing protein 17(Homo sapiens (Human))
The Scripps Research Institute Molecular Screening Center
Curated by PubChem BioAssay
LigandPNGBDBM68053(3-amino-2-N-(3-chlorophenyl)-4-N-(2-methoxyphenyl)...)
Affinity DataIC50:  6.95E+4nM. Assay description: Source (MLPCN Center Name): The Scripps Research Institute Molecular Screening Center (SRIMSC) Center Affiliation: Torrey Pines Institute for Molecul...
In DepthDetails PCBioAssay
TargetDisintegrin and metalloproteinase domain-containing protein 10(Homo sapiens (Human))
The Scripps Research Institute Molecular Screening Center
Curated by PubChem BioAssay
LigandPNGBDBM68053(3-amino-2-N-(3-chlorophenyl)-4-N-(2-methoxyphenyl)...)
Affinity DataIC50:  7.73E+3nM. Assay description: Source (MLPCN Center Name): The Scripps Research Institute Molecular Screening Center (SRIMSC) Center Affiliation: Torrey Pines Institute for Molecul...
In DepthDetails PCBioAssay
TargetDisintegrin and metalloproteinase domain-containing protein 17(Homo sapiens (Human))
The Scripps Research Institute Molecular Screening Center
Curated by PubChem BioAssay
LigandPNGBDBM68053(3-amino-2-N-(3-chlorophenyl)-4-N-(2-methoxyphenyl)...)
Affinity DataIC50:  6.95E+4nM. Assay description: Source (MLPCN Center Name): The Scripps Research Institute Molecular Screening Center (SRIMSC) Center Affiliation: Torrey Pines Institute for Molecul...
In DepthDetails PCBioAssay
TargetDisintegrin and metalloproteinase domain-containing protein 10(Homo sapiens (Human))
The Scripps Research Institute Molecular Screening Center
Curated by PubChem BioAssay
LigandPNGBDBM68053(3-amino-2-N-(3-chlorophenyl)-4-N-(2-methoxyphenyl)...)
Affinity DataIC50:  6.95E+4nM. Assay description: Source (MLPCN Center Name): The Scripps Research Institute Molecular Screening Center (SRIMSC) Center Affiliation: Torrey Pines Institute for Molecul...
In DepthDetails PCBioAssay
TargetProbable nicotinate-nucleotide adenylyltransferase(Staphylococcus aureus subsp. aureus N315)
Burnham Center For Chemical Genomics
Curated by PubChem BioAssay
LigandPNGBDBM68053(3-amino-2-N-(3-chlorophenyl)-4-N-(2-methoxyphenyl)...)
Affinity DataIC50:  8.00E+4nM
In DepthDetails PCBioAssay