BDBM68150 4-[4-(2-methylbutan-2-yl)phenoxy]aniline::MLS001007178::SMR000352462::[4-(4-tert-amylphenoxy)phenyl]amine::cid_2312594
SMILES CCC(C)(C)c1ccc(Oc2ccc(N)cc2)cc1
InChI Key InChIKey=WBBJEKAHJPQRFN-UHFFFAOYSA-N
Data  3 IC50
  Tab Delimited (TSV)   2D SDfile   Computed 3D by Vconf -m prep SDfile
Find this compound or compounds like it in BindingDB:
Activity Spreadsheet -- Enzyme Inhibition Constant Data from BindingDB
Found 3 hits for monomerid = 68150
TargetDNA damage-inducible transcript 3 protein(Mus musculus)
Emory University
Curated by PubChem BioAssay
LigandPNGBDBM68150(4-[4-(2-methylbutan-2-yl)phenoxy]aniline | MLS0010...)
Affinity DataIC50: <160nM. Assay description: NIH Molecular Libraries Screening Centers Network [MLSCN] Emory Chemical Biology Discovery Center in MLSCN Assay provider: Dr. Randal Kaufman, Univer...
In DepthDetails PCBioAssay
TargetX-box-binding protein 1(Homo sapiens (Human))
Emory University
Curated by PubChem BioAssay
LigandPNGBDBM68150(4-[4-(2-methylbutan-2-yl)phenoxy]aniline | MLS0010...)
Affinity DataIC50:  160nM. Assay description: NIH Molecular Libraries Screening Centers Network [MLSCN] Emory Chemical Biology Discovery Center in MLSCN Assay provider: Dr. Randal Kaufman, Univer...
In DepthDetails PCBioAssay
TargetDNA damage-inducible transcript 3 protein(Mus musculus)
Emory University
Curated by PubChem BioAssay
LigandPNGBDBM68150(4-[4-(2-methylbutan-2-yl)phenoxy]aniline | MLS0010...)
Affinity DataIC50: <160nM. Assay description: NIH Molecular Libraries Screening Centers Network [MLSCN] Emory Chemical Biology Discovery Center in MLSCN Assay provider: Dr. Randal Kaufman, Univer...
In DepthDetails PCBioAssay