BDBM68416 (5E)-1-(4-fluorobenzyl)-5-[(2-piperidinoethylamino)methylene]barbituric acid::(5E)-1-[(4-fluorophenyl)methyl]-5-[(2-piperidin-1-ylethylamino)methylidene]-1,3-diazinane-2,4,6-trione::(5E)-1-[(4-fluorophenyl)methyl]-5-[[2-(1-piperidinyl)ethylamino]methylidene]-1,3-diazinane-2,4,6-trione::MLS000040945::SMR000043035::cid_5389505
SMILES Fc1ccc(CN2C(=O)NC(=O)C(=CNCCN3CCCCC3)C2=O)cc1
InChI Key InChIKey=JYCSPTUHQKISAZ-UHFFFAOYSA-N
Data  1 EC50
  Tab Delimited (TSV)   2D SDfile   Computed 3D by Vconf -m prep SDfile
Find this compound or compounds like it in BindingDB:
Activity Spreadsheet -- Enzyme Inhibition Constant Data from BindingDB
Found 1 hit for monomerid = 68416
TargetGlycogen synthase kinase-3 beta(Homo sapiens (Human))
Broad Institute
Curated by PubChem BioAssay
LigandPNGBDBM68416((5E)-1-(4-fluorobenzyl)-5-[(2-piperidinoethylamino...)
Affinity DataEC50: >3.00E+5nM. Assay description: Keywords: GSK3beta, dose response, kinase, inhibition, HTS Assay Overview: The glycogen synthase kinase-3 beta (GSK-3b) is a known master regulator f...
In DepthDetails PCBioAssay