BDBM68515 2-(4-pyridyl)-2,3,5,6,7,8-hexahydro-1H-benzothiopheno[2,3-d]pyrimidin-4-one::2-pyridin-4-yl-2,3,5,6,7,8-hexahydro-1H-[1]benzothiolo[2,3-d]pyrimidin-4-one::2-pyridin-4-yl-2,3,5,6,7,8-hexahydro[1]benzothieno[2,3-d]pyrimidin-4(1H)-one::MLS000089961::SMR000024579::cid_3242605
SMILES O=C1NC(Nc2sc3CCCCc3c12)c1ccncc1
InChI Key InChIKey=XZJHMKMMWKCEGN-UHFFFAOYSA-N
Data  1 EC50
  Tab Delimited (TSV)   2D SDfile   Computed 3D by Vconf -m prep SDfile
Find this compound or compounds like it in BindingDB:
Activity Spreadsheet -- Enzyme Inhibition Constant Data from BindingDB
Found 1 hit for monomerid = 68515
TargetGlycogen synthase kinase-3 beta(Homo sapiens (Human))
Broad Institute
Curated by PubChem BioAssay
LigandPNGBDBM68515(2-(4-pyridyl)-2,3,5,6,7,8-hexahydro-1H-benzothioph...)
Affinity DataEC50: >3.00E+5nM. Assay description: Keywords: GSK3beta, dose response, kinase, inhibition, HTS Assay Overview: The glycogen synthase kinase-3 beta (GSK-3b) is a known master regulator f...
In DepthDetails PCBioAssay