BDBM68834 4-(2-Methyl-piperidin-1-yl)-quinazoline::4-(2-methyl-1-piperidinyl)quinazoline;hydrochloride::4-(2-methylpiperidin-1-yl)quinazoline;hydrochloride::4-(2-methylpiperidino)quinazoline;hydrochloride::MLS000526259::SMR000116733::cid_11948888
SMILES CC1CCCCN1c1ncnc2ccccc12
InChI Key InChIKey=BOEIMGXBJBIBFB-UHFFFAOYSA-N
Data  2 IC50  1 EC50
  Tab Delimited (TSV)   2D SDfile   Computed 3D by Vconf -m prep SDfile
Find this compound or compounds like it in BindingDB:
Activity Spreadsheet -- Enzyme Inhibition Constant Data from BindingDB
Found 3 hits for monomerid = 68834
TargetGlycogen synthase kinase-3 beta(Homo sapiens (Human))
Broad Institute
Curated by PubChem BioAssay
LigandPNGBDBM68834(4-(2-Methyl-piperidin-1-yl)-quinazoline | 4-(2-met...)
Affinity DataEC50: >3.00E+5nM. Assay description: Keywords: GSK3beta, dose response, kinase, inhibition, HTS Assay Overview: The glycogen synthase kinase-3 beta (GSK-3b) is a known master regulator f...
In DepthDetails PCBioAssay
TargetNuclear receptor coactivator 1(Homo sapiens (Human))
The Scripps Research Institute Molecular Screening Center
Curated by PubChem BioAssay
LigandPNGBDBM68834(4-(2-Methyl-piperidin-1-yl)-quinazoline | 4-(2-met...)
Affinity DataIC50: >3.59E+4nM. Assay description: Source (MLPCN Center Name): The Scripps Research Institute Molecular Screening Center (SRIMSC) Affiliation: The Scripps Research Institute, TSRI Assa...
In DepthDetails PCBioAssay
TargetNuclear receptor coactivator 3(Homo sapiens (Human))
The Scripps Research Institute Molecular Screening Center
Curated by PubChem BioAssay
LigandPNGBDBM68834(4-(2-Methyl-piperidin-1-yl)-quinazoline | 4-(2-met...)
Affinity DataIC50:  8.39E+3nM. Assay description: Source (MLPCN Center Name): The Scripps Research Institute Molecular Screening Center (SRIMSC) Affiliation: The Scripps Research Institute, TSRI Assa...
In DepthDetails PCBioAssay