BDBM69432 4-N-(2-methoxyphenyl)-2-N-(3-methoxypropyl)-5-nitropyrimidine-2,4,6-triamine::MLS000332768::N'-(2-Methoxy-phenyl)-N-(3-methoxy-propyl)-5-nitro-pyrimidine-2,4,6-triamine::N4-(2-methoxyphenyl)-N2-(3-methoxypropyl)-5-nitro-pyrimidine-2,4,6-triamine::N4-(2-methoxyphenyl)-N2-(3-methoxypropyl)-5-nitropyrimidine-2,4,6-triamine::SMR000436169::[6-amino-2-(3-methoxypropylamino)-5-nitro-pyrimidin-4-yl]-(2-methoxyphenyl)amine::cid_3937798
SMILES COCCCNc1nc(N)c(c(Nc2ccccc2OC)n1)[N+]([O-])=O
InChI Key InChIKey=NPBWOKBRRUWKFY-UHFFFAOYSA-N
Data  1 EC50
  Tab Delimited (TSV)   2D SDfile   Computed 3D by Vconf -m prep SDfile
Find this compound or compounds like it in BindingDB:
Activity Spreadsheet -- Enzyme Inhibition Constant Data from BindingDB
Found 1 hit for monomerid = 69432
TargetGlycogen synthase kinase-3 beta(Homo sapiens (Human))
Broad Institute
Curated by PubChem BioAssay
LigandPNGBDBM69432(4-N-(2-methoxyphenyl)-2-N-(3-methoxypropyl)-5-nitr...)
Affinity DataEC50:  231nM. Assay description: Keywords: GSK3beta, dose response, kinase, inhibition, HTS Assay Overview: The glycogen synthase kinase-3 beta (GSK-3b) is a known master regulator f...
In DepthDetails PCBioAssay