BDBM69912 (2E)-2-[(3-methylphenyl)methylidene]-3-oxidanylidene-N-(2-pyrrolidin-1-ylethyl)-4H-1,4-benzothiazine-6-carboxamide::(2E)-2-[(3-methylphenyl)methylidene]-3-oxo-N-(2-pyrrolidin-1-ylethyl)-4H-1,4-benzothiazine-6-carboxamide::(2E)-2-[(3-methylphenyl)methylidene]-3-oxo-N-[2-(1-pyrrolidinyl)ethyl]-4H-1,4-benzothiazine-6-carboxamide::(2E)-3-keto-2-(3-methylbenzylidene)-N-(2-pyrrolidinoethyl)-4H-1,4-benzothiazine-6-carboxamide::MLS000925125::SMR000624062::cid_24789624
SMILES Cc1cccc(\C=C2\Sc3ccc(cc3NC2=O)C(=O)NCCN2CCCC2)c1
InChI Key InChIKey=LPJFPKOKZZHARA-KGENOOAVSA-N
Data  1 IC50  2 EC50
  Tab Delimited (TSV)   2D SDfile   Computed 3D by Vconf -m prep SDfile
Find this compound or compounds like it in BindingDB:
Activity Spreadsheet -- Enzyme Inhibition Constant Data from BindingDB
Found 3 hits for monomerid = 69912
TargetGlycogen synthase kinase-3 beta(Homo sapiens (Human))
Broad Institute
Curated by PubChem BioAssay
LigandPNGBDBM69912((2E)-2-[(3-methylphenyl)methylidene]-3-oxidanylide...)
Affinity DataEC50:  6.28E+3nM. Assay description: Keywords: GSK3beta, dose response, kinase, inhibition, HTS Assay Overview: The glycogen synthase kinase-3 beta (GSK-3b) is a known master regulator f...
In DepthDetails PCBioAssay
TargetXylosyl- and glucuronyltransferase LARGE1(Homo sapiens (Human))
Burnham Center For Chemical Genomics
Curated by PubChem BioAssay
LigandPNGBDBM69912((2E)-2-[(3-methylphenyl)methylidene]-3-oxidanylide...)
Affinity DataEC50: >8.00E+4nM
In DepthDetails PCBioAssay
TargetUbiquitin-conjugating enzyme E2 N(Homo sapiens (Human))
Burnham Center For Chemical Genomics
Curated by PubChem BioAssay
LigandPNGBDBM69912((2E)-2-[(3-methylphenyl)methylidene]-3-oxidanylide...)
Affinity DataIC50: >2.00E+4nM. Assay description: Data Source: Sanford-Burnham Center for Chemical Genomics (SBCCG) Source Affiliation: Sanford-Burnham Medical Research Institute (SBMRI, San Diego CA...
In DepthDetails PCBioAssay