BDBM70280 MLS000072567::N-(3,5-Dimethyl-1-propionyl-1H-pyrazol-4-yl)-propionamide::N-(3,5-dimethyl-1-propanoyl-pyrazol-4-yl)propanamide::N-(3,5-dimethyl-1-propanoylpyrazol-4-yl)propanamide::N-(3,5-dimethyl-1-propionyl-pyrazol-4-yl)propionamide::N-[3,5-dimethyl-1-(1-oxopropyl)-4-pyrazolyl]propanamide::SMR000009319::cid_573814
SMILES CCC(=O)Nc1c(C)nn(C(=O)CC)c1C
InChI Key InChIKey=NFAOTCNRWDCIRV-UHFFFAOYSA-N
Data  2 EC50
  Tab Delimited (TSV)   2D SDfile   Computed 3D by Vconf -m prep SDfile
Find this compound or compounds like it in BindingDB:
Activity Spreadsheet -- Enzyme Inhibition Constant Data from BindingDB
Found 2 hits for monomerid = 70280
TargetProtein RecA(Mycobacterium tuberculosis H37Rv)
Broad Institute
Curated by PubChem BioAssay
LigandPNGBDBM70280(MLS000072567 | N-(3,5-Dimethyl-1-propionyl-1H-pyra...)
Affinity DataEC50: >3.80E+5nM. Assay description: Keywords: GFP-RecA intein, protein splicing, refolding, reducing reagent, GFP fluorescence Assay Overview: M. tuberculosis harbors three inteins, whi...
In DepthDetails PCBioAssay
TargetProtein RecA(Mycobacterium tuberculosis H37Rv)
Broad Institute
Curated by PubChem BioAssay
LigandPNGBDBM70280(MLS000072567 | N-(3,5-Dimethyl-1-propionyl-1H-pyra...)
Affinity DataEC50: >3.80E+5nM. Assay description: Keywords: GFP, refolding, reducing reagent, GFP fluorescence Assay Overview: M. tuberculosis harbors three inteins, which interrupt the DnaB, RecA, a...
In DepthDetails PCBioAssay