BDBM70316 1-(2,6-dimethyl-1H-indol-3-yl)-2-[4-(2-methoxyphenyl)-1-piperazinyl]ethanone::1-(2,6-dimethyl-1H-indol-3-yl)-2-[4-(2-methoxyphenyl)piperazin-1-yl]ethanone::1-(2,6-dimethyl-1H-indol-3-yl)-2-[4-(2-methoxyphenyl)piperazino]ethanone::MLS000037418::SMR000041041::cid_660119
SMILES COc1ccccc1N1CCN(CC(=O)c2c(C)[nH]c3cc(C)ccc23)CC1
InChI Key InChIKey=SXTNCJSKOIFTIW-UHFFFAOYSA-N
Data  3 EC50
  Tab Delimited (TSV)   2D SDfile   Computed 3D by Vconf -m prep SDfile
Find this compound or compounds like it in BindingDB:
Activity Spreadsheet -- Enzyme Inhibition Constant Data from BindingDB
Found 3 hits for monomerid = 70316
TargetProtein RecA(Mycobacterium tuberculosis H37Rv)
Broad Institute
Curated by PubChem BioAssay
LigandPNGBDBM70316(1-(2,6-dimethyl-1H-indol-3-yl)-2-[4-(2-methoxyphen...)
Affinity DataEC50: >3.80E+5nM. Assay description: Keywords: GFP, refolding, reducing reagent, GFP fluorescence Assay Overview: M. tuberculosis harbors three inteins, which interrupt the DnaB, RecA, a...
In DepthDetails PCBioAssay
TargetVoltage-dependent T-type calcium channel subunit alpha-1H(Homo sapiens (Human))
Vanderbilt Screening Center For Gpcrs, Ion Channels And Transporters
Curated by PubChem BioAssay
LigandPNGBDBM70316(1-(2,6-dimethyl-1H-indol-3-yl)-2-[4-(2-methoxyphen...)
Affinity DataEC50:  5.63E+3nM. Assay description: Assay Provider: Xinmin Xie Assay Provider Affiliation: Bioscience Division, SRI International, Menlo Park, CA Grant Title: HTS Assay for Cav3 T-Type ...
In DepthDetails PCBioAssay
TargetProtein RecA(Mycobacterium tuberculosis H37Rv)
Broad Institute
Curated by PubChem BioAssay
LigandPNGBDBM70316(1-(2,6-dimethyl-1H-indol-3-yl)-2-[4-(2-methoxyphen...)
Affinity DataEC50:  9.42E+4nM. Assay description: Keywords: GFP-RecA intein, protein splicing, refolding, reducing reagent, GFP fluorescence Assay Overview: M. tuberculosis harbors three inteins, whi...
In DepthDetails PCBioAssay