BDBM70318 2-[6-amino-5-cyano-4-(2,5-dimethoxyphenyl)-2,4-dihydropyrano[2,3-c]pyrazol-3-yl]acetic acid ethyl ester::MLS000036933::SMR000036536::cid_660513::ethyl 2-[6-amino-5-cyano-4-(2,5-dimethoxyphenyl)-2,4-dihydropyrano[2,3-c]pyrazol-3-yl]acetate::ethyl 2-[6-azanyl-5-cyano-4-(2,5-dimethoxyphenyl)-2,4-dihydropyrano[2,3-c]pyrazol-3-yl]ethanoate
SMILES CCOC(=O)Cc1n[nH]c2OC(=N)C(C#N)C(c12)c1cc(OC)ccc1OC
InChI Key InChIKey=IZTVKQIIXQICEC-UHFFFAOYSA-N
Data  2 EC50
  Tab Delimited (TSV)   2D SDfile   Computed 3D by Vconf -m prep SDfile
Find this compound or compounds like it in BindingDB:
Activity Spreadsheet -- Enzyme Inhibition Constant Data from BindingDB
Found 2 hits for monomerid = 70318
TargetProtein RecA(Mycobacterium tuberculosis H37Rv)
Broad Institute
Curated by PubChem BioAssay
LigandPNGBDBM70318(2-[6-amino-5-cyano-4-(2,5-dimethoxyphenyl)-2,4-dih...)
Affinity DataEC50:  1.33E+4nM. Assay description: Keywords: GFP-RecA intein, protein splicing, refolding, reducing reagent, GFP fluorescence Assay Overview: M. tuberculosis harbors three inteins, whi...
In DepthDetails PCBioAssay
TargetProtein RecA(Mycobacterium tuberculosis H37Rv)
Broad Institute
Curated by PubChem BioAssay
LigandPNGBDBM70318(2-[6-amino-5-cyano-4-(2,5-dimethoxyphenyl)-2,4-dih...)
Affinity DataEC50:  4.56E+3nM. Assay description: Keywords: GFP, refolding, reducing reagent, GFP fluorescence Assay Overview: M. tuberculosis harbors three inteins, which interrupt the DnaB, RecA, a...
In DepthDetails PCBioAssay