BDBM70329 6-amino-3-isopropyl-4-(3-pyridyl)-2,4-dihydropyrano[2,3-c]pyrazole-5-carbonitrile::6-amino-3-propan-2-yl-4-(3-pyridinyl)-2,4-dihydropyrano[2,3-c]pyrazole-5-carbonitrile::6-amino-3-propan-2-yl-4-pyridin-3-yl-2,4-dihydropyrano[2,3-c]pyrazole-5-carbonitrile::6-azanyl-3-propan-2-yl-4-pyridin-3-yl-2,4-dihydropyrano[2,3-c]pyrazole-5-carbonitrile::MLS000077981::SMR000036544::cid_664299
SMILES CC(C)c1[nH]nc2OC(=N)C(C#N)C(c12)c1cccnc1
InChI Key InChIKey=MURSNNDOKZWQBW-UHFFFAOYSA-N
Data  2 EC50
  Tab Delimited (TSV)   2D SDfile   Computed 3D by Vconf -m prep SDfile
Find this compound or compounds like it in BindingDB:
Activity Spreadsheet -- Enzyme Inhibition Constant Data from BindingDB
Found 2 hits for monomerid = 70329
TargetProtein RecA(Mycobacterium tuberculosis H37Rv)
Broad Institute
Curated by PubChem BioAssay
LigandPNGBDBM70329(6-amino-3-isopropyl-4-(3-pyridyl)-2,4-dihydropyran...)
Affinity DataEC50:  1.81E+3nM. Assay description: Keywords: GFP-RecA intein, protein splicing, refolding, reducing reagent, GFP fluorescence Assay Overview: M. tuberculosis harbors three inteins, whi...
In DepthDetails PCBioAssay
TargetProtein RecA(Mycobacterium tuberculosis H37Rv)
Broad Institute
Curated by PubChem BioAssay
LigandPNGBDBM70329(6-amino-3-isopropyl-4-(3-pyridyl)-2,4-dihydropyran...)
Affinity DataEC50:  6.49E+4nM. Assay description: Keywords: GFP, refolding, reducing reagent, GFP fluorescence Assay Overview: M. tuberculosis harbors three inteins, which interrupt the DnaB, RecA, a...
In DepthDetails PCBioAssay